{"text_format":"1","workbook":"xlsx","n_sheets":9,"sheets":["EKG","Graph","ddlb_Control","<RGT.Sheet_info.dim2>","MEAS LAYOUT","Case-pack","Notes","ILD-Data-1-Ref","Picture"],"not_rendered":{"charts":4,"images":15,"macros":1,"external_links":0,"defined_names":26,"comments":3,"pivot_tables":0},"unopened":[],"bounds":{"document_bytes":16777216,"sheet_cells":100000,"rows_first":2000,"rows_last":500,"rows_between":2000,"halvings":0,"cell_chars":16384,"cell_head_chars":4096},"cells_cut":0,"cells_raw":0,"read":"whole","date_system":"1900"}

{"sheet":"EKG","index":0,"n_rows":120,"n_cols":51,"rows_kept":120,"cut":false,"hidden":false,"merged":[[2,27,2,30],[112,12,112,13],[3,44,4,44]]}
["-",null,1,null,null,null,null,null,null,null,null,null,null,null,null,null,null,null,null,null,null,null,null,null,null,null,"EKG"]
[null,"Rice Pasta"]
[]
[null,null,null,null,null,null,null,null,null,null,null,null,null,null,null,null,null,null,null,null,null,null,null,null,null,null,null,null,null,null,null,null,null,null,null,null,null,null,null,null,null,null,null,null,"Case Pack Equivalency Factor"]
[null,"RICE-PASTA-ETHNIC SPECIALTIES"]
[null,"Week","Dol Sales","Units","Units Any Merch","Units No Merch","Base Cases","Incremental Cases","Non-Promoted Cases","Promoted Cases","Total Cases","Avg Price/Unit","Avg Price per Unit No Merch","Avg Price Any Merch","% Lift","ACV Wtd Dist.","% ACV Any Merch","%ACV Any Feature","% ACV Front Page Feature","% ACV Any Display","% ACV Feat & Display","Num of Displays ","Num of Disp Chg YAG","Num of Disp % Chg YAG","Inv on Display Cases","Inv on Disp Chg YAG","Inv on Disp % Chg YAG",null,null,null,null,null,null,null,null,null,null,null,null,null,null,null,null,null,{"$f":"C1","v":1},null,"Base Cases","Incremental Cases","Non-Promoted Cases","Promoted Cases","Total Cases"]
[null,null,null,null,null,null,{"$f":"AU7/$AS$6","v":0},{"$f":"AV7/$AS$6","v":0},{"$f":"AW7/$AS$6","v":0},{"$f":"AX7/$AS$6","v":0},{"$f":"AY7/$AS$6","v":0}]
[null,null,null,null,null,null,{"$f":"AU8/$AS$6","v":0},{"$f":"AV8/$AS$6","v":0},{"$f":"AW8/$AS$6","v":0},{"$f":"AX8/$AS$6","v":0},{"$f":"AY8/$AS$6","v":0}]
[null,null,null,null,null,null,0,0,0,0,0]
[null,null,null,null,null,null,0,0,0,0,0]
[null,null,null,null,null,null,0,0,0,0,0]
[null,null,null,null,null,null,0,0,0,0,0]
[null,null,null,null,null,null,0,0,0,0,0]
[null,null,null,null,null,null,0,0,0,0,0]
[null,null,null,null,null,null,0,0,0,0,0]
[null,null,null,null,null,null,0,0,0,0,0]
[null,null,null,null,null,null,0,0,0,0,0]
[null,null,null,null,null,null,0,0,0,0,0]
[null,null,null,null,null,null,0,0,0,0,0]
[null,null,null,null,null,null,0,0,0,0,0]
{"$rows_left_out":101}
{"sheet":"Graph","index":1,"n_rows":6,"n_cols":6,"rows_kept":6,"cut":false,"hidden":false,"merged":[]}
[]
[]
[]
[null,"Product:","RICE-PASTA-ETHNIC SPECIALTIES",null,null,"Non-Promoted Cases"]
[null,"Time:","Latest 52 Weeks",null,null,"Promoted Cases"]
[null,"Geography:",null,null,null,"% ACV Any Display"]

{"sheet":"ddlb_Control","index":2,"n_rows":3,"n_cols":6,"rows_kept":3,"cut":false,"hidden":true,"merged":[]}
["Time","Selected",null,1,null,1]
["Latest 52 Weeks",1]
["YA 52 Weeks"]

{"sheet":"<RGT.Sheet_info.dim2>","index":3,"n_rows":2,"n_cols":7,"rows_kept":2,"cut":false,"hidden":true,"merged":[]}
[null,null,null,null,null,null,{"$f":"MID(Picture!A1,13,30)","v":null}]
[null,null,null,null,null,null,1]

{"sheet":"MEAS LAYOUT","index":4,"n_rows":109,"n_cols":33,"rows_kept":109,"cut":false,"hidden":true,"merged":[]}
["Week","Dol Sales","Units","Units Any Merch","Units No Merch","Base Cases","Incremental Cases","Non-Promoted Cases","Promoted Cases","Total Cases","Avg Price/Unit","Avg Price per Unit - No Merch","Avg Price Any Merch","% Lift","ACV Wtd Dist.","% ACV Any Merch","%ACV Any Feature","% ACV Front Page Feature","% ACV Any Display","% ACV Feat & Display","Num of Displays ","Num of Disp Chg YAG","Num of Disp % Chg YAG","Inv on Display Cases","Inv on Disp Chg YAG","Inv on Disp % Chg YAG","Column AB",null,null," Michael Jordan SKU's","XLCACSANNC7963P11",null,"TOTAL US - GROC"]
["WkE 05/23/10",124321.6,73818.26,46096.2874755859,27721.9703369141,3935.25390625,2216.267578125,2310.16419474284,3841.35728963216,6151.521484375,1.6842,1.9312,1.5356,0.5632,70.6786,35.2239,4.4273,0,10.5051,0.9652,2150.2781,2150.27807617187,null,3397.432,3397.43212890625,null,1.68415757576912,null,null," Ttl Gatorade & Tiger SPDK 32oz1ct C-store","XLCACSANNC7963P12",null,12]
["WkE 05/30/10",120105.4,68570.62,38147.1136474609,30423.5035400391,4217.06966145833,1497.1484375,2535.29196166992,3178.92613728841,5714.21809895833,1.7516,1.9391,1.602,0.355,72.274,33.057,3.9901,0,5.1286,0.3268,1400.8059,1400.80590820312,null,1902.818,1902.818359375,null,1.75155744437275,null,null,"+GATRD ASST TQNCH 12CT     240OZ 5200020162","P553"]
["WkE 06/06/10",120107.7,66856.31,29210.2866821289,37646.0258178711,4536.31998697917,1035.03938802083,3137.16881815592,2434.19055684408,5571.359375,1.7965,1.9545,1.5929,0.2282,72.0011,24.1392,1.5767,0,4.9887,0.1156,1367.884,1367.88403320313,null,1734.25,1734.24951171875,null,1.79650528512173,null,null,"+GATRD ASST TQNCH 18CT     216OZ 5200012324","P224"]
[]
[]
[]
[]
[]
[]
[]
[]
[]
[]
[]
[]
[]
[]
[]
[]
{"$rows_left_out":90}
{"sheet":"Case-pack","index":5,"n_rows":427,"n_cols":7,"rows_kept":427,"cut":false,"hidden":true,"merged":[]}
[{"$f":"OFFSET(ProdList,ddlb_Control!D1-1,0)","v":0},{"$f":"MATCH(A1,D:D,0)","v":{"$error":"#N/A"}},null,"SPORTS DRINKS",1,1,"SD"]
[null,{"$f":"MATCH(A1,ddlb_Control!C:C,0)-1","v":{"$error":"#N/A"}},null,"SD TOTAL GATORADE SD",1]
[null,null,null,"SD GATORADE THIRST QUENCHER",1]
[null,null,null,"SD 12 OZ 6 CT PLBTL TOTAL GATORADE SD",1]
[null,null,null,"SD 12 OZ 12 CT PLBTL TOTAL GATORADE SD",1]
[null,null,null,"SD 12 OZ 18 CT PLBTL TOTAL GATORADE SD",1]
[null,null,null,"Ttl Gatorade 12 oz All Count_22.0",1]
[null,null,null,"SD 20 OZ 1 CT PLBTL TOTAL GATORADE SD",1]
[null,null,null,"SD 20 OZ 8 CT PLBTL TOTAL GATORADE SD",1]
[null,null,null,"TTL GAT SPDK 32OZ 28OZ 1CT_22.0",1]
[null,null,null,"SD 28 OZ 1 CT PLBTL TOTAL GATORADE SD",1]
[null,null,null,"SD 32 OZ 1 CT PLBTL TOTAL GATORADE SD",1]
[null,null,null,"Ttl Gatorade 32 oz All Count_22.0",1]
[null,null,null,"SD 64 OZ 1 CT PLBTL TOTAL GATORADE SD",1]
[null,null,null,"SD GTRD THIRST QENCHER 128 OZ (1G) 1 CT PLASTIC BOTTLE",1]
[null,null,null,"Total QTG SPDK Bulk Powder_22.0",1]
[null,null,null,"SD 768 OZ (6G) 1 CT CNSTR TOTAL GATORADE SD",1]
[null,null,null,"Total Gatorade Prime_22.0",1]
[null,null,null,"SD GATORADE PRIME",1]
[null,null,null,"EN CH GATORADE PRIME",1]
{"$rows_left_out":408}
{"sheet":"Notes","index":6,"n_rows":44,"n_cols":7,"rows_kept":44,"cut":false,"hidden":true,"merged":[]}
["NOTES TAB - FOR INTERNAL IRI USE ONLY - should be removed programmatically by last PPC step."]
["Template Change Log:"]
["Date","Who","Notes"]
["2008-08-12","Lam","Example note - added 2 new products to xyz section."]
["2008-08-12","Lam","Added Notes tab"]
[]
[]
[]
["Developer Notes Log:"]
["Date","Who","Notes"]
["2008-08-12","Lefflbine","Example note - adjusted jobcard to increase processing efficiency."]
[]
[]
[]
[]
["Saved Selections Used:"]
["Rpt#","ID","SS Key","Db","Description","Dimension","Creator"]
["qtg_rpt304","LIBRARY"," XLCACSLIZC7187P89","C7187P8","cpgn_qtg_rpt304_prod_ls","PROD","CSLIZ"]
["qtg_rpt304","LIBRARY"," XLCACSNODC9717P86","C9717P8","cpgn_qtg_rpt304_prod_cjd","PROD","CSNOD"]
["qtg_rpt304","LIBRARY"," XLCACSLIZC7187P810","C7187P8","cpgn_qtg_rpt304_prod_ws","PROD","CSLIZ"]
{"$rows_left_out":25}
{"sheet":"ILD-Data-1-Ref","index":7,"n_rows":105,"n_cols":26,"rows_kept":105,"cut":false,"hidden":true,"merged":[]}
[{"$f":"Picture!B5","v":0},{"$f":"Picture!C5","v":0},{"$f":"Picture!D5","v":0},{"$f":"Picture!E5","v":0},{"$f":"Picture!F5","v":0},{"$f":"Picture!G5","v":0},{"$f":"Picture!H5","v":0},{"$f":"Picture!I5","v":0},{"$f":"Picture!J5","v":0},{"$f":"Picture!K5","v":0},{"$f":"Picture!L5","v":0},{"$f":"Picture!M5","v":0},{"$f":"Picture!N5","v":0},{"$f":"Picture!O5","v":0},{"$f":"Picture!P5","v":0},{"$f":"Picture!Q5","v":0},{"$f":"Picture!R5","v":0},{"$f":"Picture!S5","v":0},{"$f":"Picture!T5","v":0},{"$f":"Picture!U5","v":0},{"$f":"Picture!V5","v":0},{"$f":"Picture!W5","v":0},{"$f":"Picture!X5","v":0},{"$f":"Picture!Y5","v":0},{"$f":"Picture!Z5","v":0},{"$f":"Picture!AA5","v":0}]
[{"$f":"Picture!B6","v":0},{"$f":"Picture!C6","v":0},{"$f":"Picture!D6","v":0},{"$f":"Picture!E6","v":0},{"$f":"Picture!F6","v":0},{"$f":"Picture!G6","v":0},{"$f":"Picture!H6","v":0},{"$f":"Picture!I6","v":0},{"$f":"Picture!J6","v":0},{"$f":"Picture!K6","v":0},{"$f":"Picture!L6","v":0},{"$f":"Picture!M6","v":0},{"$f":"Picture!N6","v":0},{"$f":"Picture!O6","v":0},{"$f":"Picture!P6","v":0},{"$f":"Picture!Q6","v":0},{"$f":"Picture!R6","v":0},{"$f":"Picture!S6","v":0},{"$f":"Picture!T6","v":0},{"$f":"Picture!U6","v":0},{"$f":"Picture!V6","v":0},{"$f":"Picture!W6","v":0},{"$f":"Picture!X6","v":0},{"$f":"Picture!Y6","v":0},{"$f":"Picture!Z6","v":0},{"$f":"Picture!AA6","v":0}]
[{"$f":"Picture!B7","v":0},{"$f":"Picture!C7","v":0},{"$f":"Picture!D7","v":0},{"$f":"Picture!E7","v":0},{"$f":"Picture!F7","v":0},{"$f":"Picture!G7","v":0},{"$f":"Picture!H7","v":0},{"$f":"Picture!I7","v":0},{"$f":"Picture!J7","v":0},{"$f":"Picture!K7","v":0},{"$f":"Picture!L7","v":0},{"$f":"Picture!M7","v":0},{"$f":"Picture!N7","v":0},{"$f":"Picture!O7","v":0},{"$f":"Picture!P7","v":0},{"$f":"Picture!Q7","v":0},{"$f":"Picture!R7","v":0},{"$f":"Picture!S7","v":0},{"$f":"Picture!T7","v":0},{"$f":"Picture!U7","v":0},{"$f":"Picture!V7","v":0},{"$f":"Picture!W7","v":0},{"$f":"Picture!X7","v":0},{"$f":"Picture!Y7","v":0},{"$f":"Picture!Z7","v":0},{"$f":"Picture!AA7","v":0}]
[{"$f":"Picture!B8","v":0},{"$f":"Picture!C8","v":0},{"$f":"Picture!D8","v":0},{"$f":"Picture!E8","v":0},{"$f":"Picture!F8","v":0},{"$f":"Picture!G8","v":0},{"$f":"Picture!H8","v":0},{"$f":"Picture!I8","v":0},{"$f":"Picture!J8","v":0},{"$f":"Picture!K8","v":0},{"$f":"Picture!L8","v":0},{"$f":"Picture!M8","v":0},{"$f":"Picture!N8","v":0},{"$f":"Picture!O8","v":0},{"$f":"Picture!P8","v":0},{"$f":"Picture!Q8","v":0},{"$f":"Picture!R8","v":0},{"$f":"Picture!S8","v":0},{"$f":"Picture!T8","v":0},{"$f":"Picture!U8","v":0},{"$f":"Picture!V8","v":0},{"$f":"Picture!W8","v":0},{"$f":"Picture!X8","v":0},{"$f":"Picture!Y8","v":0},{"$f":"Picture!Z8","v":0},{"$f":"Picture!AA8","v":0}]
[{"$f":"Picture!B9","v":0},{"$f":"Picture!C9","v":0},{"$f":"Picture!D9","v":0},{"$f":"Picture!E9","v":0},{"$f":"Picture!F9","v":0},{"$f":"Picture!G9","v":0},{"$f":"Picture!H9","v":0},{"$f":"Picture!I9","v":0},{"$f":"Picture!J9","v":0},{"$f":"Picture!K9","v":0},{"$f":"Picture!L9","v":0},{"$f":"Picture!M9","v":0},{"$f":"Picture!N9","v":0},{"$f":"Picture!O9","v":0},{"$f":"Picture!P9","v":0},{"$f":"Picture!Q9","v":0},{"$f":"Picture!R9","v":0},{"$f":"Picture!S9","v":0},{"$f":"Picture!T9","v":0},{"$f":"Picture!U9","v":0},{"$f":"Picture!V9","v":0},{"$f":"Picture!W9","v":0},{"$f":"Picture!X9","v":0},{"$f":"Picture!Y9","v":0},{"$f":"Picture!Z9","v":0},{"$f":"Picture!AA9","v":0}]
[{"$f":"Picture!B10","v":0},{"$f":"Picture!C10","v":0},{"$f":"Picture!D10","v":0},{"$f":"Picture!E10","v":0},{"$f":"Picture!F10","v":0},{"$f":"Picture!G10","v":0},{"$f":"Picture!H10","v":0},{"$f":"Picture!I10","v":0},{"$f":"Picture!J10","v":0},{"$f":"Picture!K10","v":0},{"$f":"Picture!L10","v":0},{"$f":"Picture!M10","v":0},{"$f":"Picture!N10","v":0},{"$f":"Picture!O10","v":0},{"$f":"Picture!P10","v":0},{"$f":"Picture!Q10","v":0},{"$f":"Picture!R10","v":0},{"$f":"Picture!S10","v":0},{"$f":"Picture!T10","v":0},{"$f":"Picture!U10","v":0},{"$f":"Picture!V10","v":0},{"$f":"Picture!W10","v":0},{"$f":"Picture!X10","v":0},{"$f":"Picture!Y10","v":0},{"$f":"Picture!Z10","v":0},{"$f":"Picture!AA10","v":0}]
[{"$f":"Picture!B11","v":0},{"$f":"Picture!C11","v":0},{"$f":"Picture!D11","v":0},{"$f":"Picture!E11","v":0},{"$f":"Picture!F11","v":0},{"$f":"Picture!G11","v":0},{"$f":"Picture!H11","v":0},{"$f":"Picture!I11","v":0},{"$f":"Picture!J11","v":0},{"$f":"Picture!K11","v":0},{"$f":"Picture!L11","v":0},{"$f":"Picture!M11","v":0},{"$f":"Picture!N11","v":0},{"$f":"Picture!O11","v":0},{"$f":"Picture!P11","v":0},{"$f":"Picture!Q11","v":0},{"$f":"Picture!R11","v":0},{"$f":"Picture!S11","v":0},{"$f":"Picture!T11","v":0},{"$f":"Picture!U11","v":0},{"$f":"Picture!V11","v":0},{"$f":"Picture!W11","v":0},{"$f":"Picture!X11","v":0},{"$f":"Picture!Y11","v":0},{"$f":"Picture!Z11","v":0},{"$f":"Picture!AA11","v":0}]
[{"$f":"Picture!B12","v":0},{"$f":"Picture!C12","v":0},{"$f":"Picture!D12","v":0},{"$f":"Picture!E12","v":0},{"$f":"Picture!F12","v":0},{"$f":"Picture!G12","v":0},{"$f":"Picture!H12","v":0},{"$f":"Picture!I12","v":0},{"$f":"Picture!J12","v":0},{"$f":"Picture!K12","v":0},{"$f":"Picture!L12","v":0},{"$f":"Picture!M12","v":0},{"$f":"Picture!N12","v":0},{"$f":"Picture!O12","v":0},{"$f":"Picture!P12","v":0},{"$f":"Picture!Q12","v":0},{"$f":"Picture!R12","v":0},{"$f":"Picture!S12","v":0},{"$f":"Picture!T12","v":0},{"$f":"Picture!U12","v":0},{"$f":"Picture!V12","v":0},{"$f":"Picture!W12","v":0},{"$f":"Picture!X12","v":0},{"$f":"Picture!Y12","v":0},{"$f":"Picture!Z12","v":0},{"$f":"Picture!AA12","v":0}]
[{"$f":"Picture!B13","v":0},{"$f":"Picture!C13","v":0},{"$f":"Picture!D13","v":0},{"$f":"Picture!E13","v":0},{"$f":"Picture!F13","v":0},{"$f":"Picture!G13","v":0},{"$f":"Picture!H13","v":0},{"$f":"Picture!I13","v":0},{"$f":"Picture!J13","v":0},{"$f":"Picture!K13","v":0},{"$f":"Picture!L13","v":0},{"$f":"Picture!M13","v":0},{"$f":"Picture!N13","v":0},{"$f":"Picture!O13","v":0},{"$f":"Picture!P13","v":0},{"$f":"Picture!Q13","v":0},{"$f":"Picture!R13","v":0},{"$f":"Picture!S13","v":0},{"$f":"Picture!T13","v":0},{"$f":"Picture!U13","v":0},{"$f":"Picture!V13","v":0},{"$f":"Picture!W13","v":0},{"$f":"Picture!X13","v":0},{"$f":"Picture!Y13","v":0},{"$f":"Picture!Z13","v":0},{"$f":"Picture!AA13","v":0}]
[{"$f":"Picture!B14","v":0},{"$f":"Picture!C14","v":0},{"$f":"Picture!D14","v":0},{"$f":"Picture!E14","v":0},{"$f":"Picture!F14","v":0},{"$f":"Picture!G14","v":0},{"$f":"Picture!H14","v":0},{"$f":"Picture!I14","v":0},{"$f":"Picture!J14","v":0},{"$f":"Picture!K14","v":0},{"$f":"Picture!L14","v":0},{"$f":"Picture!M14","v":0},{"$f":"Picture!N14","v":0},{"$f":"Picture!O14","v":0},{"$f":"Picture!P14","v":0},{"$f":"Picture!Q14","v":0},{"$f":"Picture!R14","v":0},{"$f":"Picture!S14","v":0},{"$f":"Picture!T14","v":0},{"$f":"Picture!U14","v":0},{"$f":"Picture!V14","v":0},{"$f":"Picture!W14","v":0},{"$f":"Picture!X14","v":0},{"$f":"Picture!Y14","v":0},{"$f":"Picture!Z14","v":0},{"$f":"Picture!AA14","v":0}]
[{"$f":"Picture!B15","v":0},{"$f":"Picture!C15","v":0},{"$f":"Picture!D15","v":0},{"$f":"Picture!E15","v":0},{"$f":"Picture!F15","v":0},{"$f":"Picture!G15","v":0},{"$f":"Picture!H15","v":0},{"$f":"Picture!I15","v":0},{"$f":"Picture!J15","v":0},{"$f":"Picture!K15","v":0},{"$f":"Picture!L15","v":0},{"$f":"Picture!M15","v":0},{"$f":"Picture!N15","v":0},{"$f":"Picture!O15","v":0},{"$f":"Picture!P15","v":0},{"$f":"Picture!Q15","v":0},{"$f":"Picture!R15","v":0},{"$f":"Picture!S15","v":0},{"$f":"Picture!T15","v":0},{"$f":"Picture!U15","v":0},{"$f":"Picture!V15","v":0},{"$f":"Picture!W15","v":0},{"$f":"Picture!X15","v":0},{"$f":"Picture!Y15","v":0},{"$f":"Picture!Z15","v":0},{"$f":"Picture!AA15","v":0}]
[{"$f":"Picture!B16","v":0},{"$f":"Picture!C16","v":0},{"$f":"Picture!D16","v":0},{"$f":"Picture!E16","v":0},{"$f":"Picture!F16","v":0},{"$f":"Picture!G16","v":0},{"$f":"Picture!H16","v":0},{"$f":"Picture!I16","v":0},{"$f":"Picture!J16","v":0},{"$f":"Picture!K16","v":0},{"$f":"Picture!L16","v":0},{"$f":"Picture!M16","v":0},{"$f":"Picture!N16","v":0},{"$f":"Picture!O16","v":0},{"$f":"Picture!P16","v":0},{"$f":"Picture!Q16","v":0},{"$f":"Picture!R16","v":0},{"$f":"Picture!S16","v":0},{"$f":"Picture!T16","v":0},{"$f":"Picture!U16","v":0},{"$f":"Picture!V16","v":0},{"$f":"Picture!W16","v":0},{"$f":"Picture!X16","v":0},{"$f":"Picture!Y16","v":0},{"$f":"Picture!Z16","v":0},{"$f":"Picture!AA16","v":0}]
[{"$f":"Picture!B17","v":0},{"$f":"Picture!C17","v":0},{"$f":"Picture!D17","v":0},{"$f":"Picture!E17","v":0},{"$f":"Picture!F17","v":0},{"$f":"Picture!G17","v":0},{"$f":"Picture!H17","v":0},{"$f":"Picture!I17","v":0},{"$f":"Picture!J17","v":0},{"$f":"Picture!K17","v":0},{"$f":"Picture!L17","v":0},{"$f":"Picture!M17","v":0},{"$f":"Picture!N17","v":0},{"$f":"Picture!O17","v":0},{"$f":"Picture!P17","v":0},{"$f":"Picture!Q17","v":0},{"$f":"Picture!R17","v":0},{"$f":"Picture!S17","v":0},{"$f":"Picture!T17","v":0},{"$f":"Picture!U17","v":0},{"$f":"Picture!V17","v":0},{"$f":"Picture!W17","v":0},{"$f":"Picture!X17","v":0},{"$f":"Picture!Y17","v":0},{"$f":"Picture!Z17","v":0},{"$f":"Picture!AA17","v":0}]
[{"$f":"Picture!B18","v":0},{"$f":"Picture!C18","v":0},{"$f":"Picture!D18","v":0},{"$f":"Picture!E18","v":0},{"$f":"Picture!F18","v":0},{"$f":"Picture!G18","v":0},{"$f":"Picture!H18","v":0},{"$f":"Picture!I18","v":0},{"$f":"Picture!J18","v":0},{"$f":"Picture!K18","v":0},{"$f":"Picture!L18","v":0},{"$f":"Picture!M18","v":0},{"$f":"Picture!N18","v":0},{"$f":"Picture!O18","v":0},{"$f":"Picture!P18","v":0},{"$f":"Picture!Q18","v":0},{"$f":"Picture!R18","v":0},{"$f":"Picture!S18","v":0},{"$f":"Picture!T18","v":0},{"$f":"Picture!U18","v":0},{"$f":"Picture!V18","v":0},{"$f":"Picture!W18","v":0},{"$f":"Picture!X18","v":0},{"$f":"Picture!Y18","v":0},{"$f":"Picture!Z18","v":0},{"$f":"Picture!AA18","v":0}]
[{"$f":"Picture!B19","v":0},{"$f":"Picture!C19","v":0},{"$f":"Picture!D19","v":0},{"$f":"Picture!E19","v":0},{"$f":"Picture!F19","v":0},{"$f":"Picture!G19","v":0},{"$f":"Picture!H19","v":0},{"$f":"Picture!I19","v":0},{"$f":"Picture!J19","v":0},{"$f":"Picture!K19","v":0},{"$f":"Picture!L19","v":0},{"$f":"Picture!M19","v":0},{"$f":"Picture!N19","v":0},{"$f":"Picture!O19","v":0},{"$f":"Picture!P19","v":0},{"$f":"Picture!Q19","v":0},{"$f":"Picture!R19","v":0},{"$f":"Picture!S19","v":0},{"$f":"Picture!T19","v":0},{"$f":"Picture!U19","v":0},{"$f":"Picture!V19","v":0},{"$f":"Picture!W19","v":0},{"$f":"Picture!X19","v":0},{"$f":"Picture!Y19","v":0},{"$f":"Picture!Z19","v":0},{"$f":"Picture!AA19","v":0}]
[{"$f":"Picture!B20","v":0},{"$f":"Picture!C20","v":0},{"$f":"Picture!D20","v":0},{"$f":"Picture!E20","v":0},{"$f":"Picture!F20","v":0},{"$f":"Picture!G20","v":0},{"$f":"Picture!H20","v":0},{"$f":"Picture!I20","v":0},{"$f":"Picture!J20","v":0},{"$f":"Picture!K20","v":0},{"$f":"Picture!L20","v":0},{"$f":"Picture!M20","v":0},{"$f":"Picture!N20","v":0},{"$f":"Picture!O20","v":0},{"$f":"Picture!P20","v":0},{"$f":"Picture!Q20","v":0},{"$f":"Picture!R20","v":0},{"$f":"Picture!S20","v":0},{"$f":"Picture!T20","v":0},{"$f":"Picture!U20","v":0},{"$f":"Picture!V20","v":0},{"$f":"Picture!W20","v":0},{"$f":"Picture!X20","v":0},{"$f":"Picture!Y20","v":0},{"$f":"Picture!Z20","v":0},{"$f":"Picture!AA20","v":0}]
[{"$f":"Picture!B21","v":0},{"$f":"Picture!C21","v":0},{"$f":"Picture!D21","v":0},{"$f":"Picture!E21","v":0},{"$f":"Picture!F21","v":0},{"$f":"Picture!G21","v":0},{"$f":"Picture!H21","v":0},{"$f":"Picture!I21","v":0},{"$f":"Picture!J21","v":0},{"$f":"Picture!K21","v":0},{"$f":"Picture!L21","v":0},{"$f":"Picture!M21","v":0},{"$f":"Picture!N21","v":0},{"$f":"Picture!O21","v":0},{"$f":"Picture!P21","v":0},{"$f":"Picture!Q21","v":0},{"$f":"Picture!R21","v":0},{"$f":"Picture!S21","v":0},{"$f":"Picture!T21","v":0},{"$f":"Picture!U21","v":0},{"$f":"Picture!V21","v":0},{"$f":"Picture!W21","v":0},{"$f":"Picture!X21","v":0},{"$f":"Picture!Y21","v":0},{"$f":"Picture!Z21","v":0},{"$f":"Picture!AA21","v":0}]
[{"$f":"Picture!B22","v":0},{"$f":"Picture!C22","v":0},{"$f":"Picture!D22","v":0},{"$f":"Picture!E22","v":0},{"$f":"Picture!F22","v":0},{"$f":"Picture!G22","v":0},{"$f":"Picture!H22","v":0},{"$f":"Picture!I22","v":0},{"$f":"Picture!J22","v":0},{"$f":"Picture!K22","v":0},{"$f":"Picture!L22","v":0},{"$f":"Picture!M22","v":0},{"$f":"Picture!N22","v":0},{"$f":"Picture!O22","v":0},{"$f":"Picture!P22","v":0},{"$f":"Picture!Q22","v":0},{"$f":"Picture!R22","v":0},{"$f":"Picture!S22","v":0},{"$f":"Picture!T22","v":0},{"$f":"Picture!U22","v":0},{"$f":"Picture!V22","v":0},{"$f":"Picture!W22","v":0},{"$f":"Picture!X22","v":0},{"$f":"Picture!Y22","v":0},{"$f":"Picture!Z22","v":0},{"$f":"Picture!AA22","v":0}]
[{"$f":"Picture!B23","v":0},{"$f":"Picture!C23","v":0},{"$f":"Picture!D23","v":0},{"$f":"Picture!E23","v":0},{"$f":"Picture!F23","v":0},{"$f":"Picture!G23","v":0},{"$f":"Picture!H23","v":0},{"$f":"Picture!I23","v":0},{"$f":"Picture!J23","v":0},{"$f":"Picture!K23","v":0},{"$f":"Picture!L23","v":0},{"$f":"Picture!M23","v":0},{"$f":"Picture!N23","v":0},{"$f":"Picture!O23","v":0},{"$f":"Picture!P23","v":0},{"$f":"Picture!Q23","v":0},{"$f":"Picture!R23","v":0},{"$f":"Picture!S23","v":0},{"$f":"Picture!T23","v":0},{"$f":"Picture!U23","v":0},{"$f":"Picture!V23","v":0},{"$f":"Picture!W23","v":0},{"$f":"Picture!X23","v":0},{"$f":"Picture!Y23","v":0},{"$f":"Picture!Z23","v":0},{"$f":"Picture!AA23","v":0}]
[{"$f":"Picture!B24","v":0},{"$f":"Picture!C24","v":0},{"$f":"Picture!D24","v":0},{"$f":"Picture!E24","v":0},{"$f":"Picture!F24","v":0},{"$f":"Picture!G24","v":0},{"$f":"Picture!H24","v":0},{"$f":"Picture!I24","v":0},{"$f":"Picture!J24","v":0},{"$f":"Picture!K24","v":0},{"$f":"Picture!L24","v":0},{"$f":"Picture!M24","v":0},{"$f":"Picture!N24","v":0},{"$f":"Picture!O24","v":0},{"$f":"Picture!P24","v":0},{"$f":"Picture!Q24","v":0},{"$f":"Picture!R24","v":0},{"$f":"Picture!S24","v":0},{"$f":"Picture!T24","v":0},{"$f":"Picture!U24","v":0},{"$f":"Picture!V24","v":0},{"$f":"Picture!W24","v":0},{"$f":"Picture!X24","v":0},{"$f":"Picture!Y24","v":0},{"$f":"Picture!Z24","v":0},{"$f":"Picture!AA24","v":0}]
{"$rows_left_out":86}
{"sheet":"Picture","index":8,"n_rows":0,"n_cols":0,"rows_kept":0,"cut":false,"hidden":true,"merged":[[0,2,1,2]]}