{"text_format":"1","workbook":"xlsx","n_sheets":9,"sheets":["EKG","Graph","ddlb_Control","<RGT.Sheet_info.dim2>","MEAS LAYOUT","Case-pack","Notes","ILD-Data-1-Ref","Picture"],"not_rendered":{"charts":4,"images":15,"macros":1,"external_links":0,"defined_names":26,"comments":3,"pivot_tables":0},"unopened":[],"bounds":{"document_bytes":16777216,"sheet_cells":100000,"rows_first":2000,"rows_last":500,"rows_between":2000,"halvings":0,"cell_chars":16384,"cell_head_chars":4096},"cells_cut":0,"cells_raw":0,"read":"whole","date_system":"1900"}

{"sheet":"EKG","index":0,"n_rows":120,"n_cols":51,"rows_kept":120,"cut":false,"hidden":false,"merged":[[2,27,2,30],[112,12,112,13],[3,44,4,44]]}
["-",null,1,null,null,null,null,null,null,null,null,null,null,null,null,null,null,null,null,null,null,null,null,null,null,null,"EKG"]
[null,"Rice Pasta"]
[]
[null,null,null,null,null,null,null,null,null,null,null,null,null,null,null,null,null,null,null,null,null,null,null,null,null,null,null,null,null,null,null,null,null,null,null,null,null,null,null,null,null,null,null,null,"Case Pack Equivalency Factor"]
[null,"RICE-PASTA-ETHNIC SPECIALTIES"]
[null,"Week","Dol Sales","Units","Units Any Merch","Units No Merch","Base Cases","Incremental Cases","Non-Promoted Cases","Promoted Cases","Total Cases","Avg Price/Unit","Avg Price per Unit No Merch","Avg Price Any Merch","% Lift","ACV Wtd Dist.","% ACV Any Merch","%ACV Any Feature","% ACV Front Page Feature","% ACV Any Display","% ACV Feat & Display","Num of Displays ","Num of Disp Chg YAG","Num of Disp % Chg YAG","Inv on Display Cases","Inv on Disp Chg YAG","Inv on Disp % Chg YAG",null,null,null,null,null,null,null,null,null,null,null,null,null,null,null,null,null,{"$f":"C1","v":1},null,"Base Cases","Incremental Cases","Non-Promoted Cases","Promoted Cases","Total Cases"]
[null,null,null,null,null,null,{"$f":"AU7/$AS$6","v":0},{"$f":"AV7/$AS$6","v":0},{"$f":"AW7/$AS$6","v":0},{"$f":"AX7/$AS$6","v":0},{"$f":"AY7/$AS$6","v":0}]
[null,null,null,null,null,null,{"$f":"AU8/$AS$6","v":0},{"$f":"AV8/$AS$6","v":0},{"$f":"AW8/$AS$6","v":0},{"$f":"AX8/$AS$6","v":0},{"$f":"AY8/$AS$6","v":0}]
[null,null,null,null,null,null,0,0,0,0,0]
[null,null,null,null,null,null,0,0,0,0,0]
[null,null,null,null,null,null,0,0,0,0,0]
[null,null,null,null,null,null,0,0,0,0,0]
[null,null,null,null,null,null,0,0,0,0,0]
[null,null,null,null,null,null,0,0,0,0,0]
[null,null,null,null,null,null,0,0,0,0,0]
[null,null,null,null,null,null,0,0,0,0,0]
[null,null,null,null,null,null,0,0,0,0,0]
[null,null,null,null,null,null,0,0,0,0,0]
[null,null,null,null,null,null,0,0,0,0,0]
[null,null,null,null,null,null,0,0,0,0,0]
[null,null,null,null,null,null,0,0,0,0,0]
[null,null,null,null,null,null,0,0,0,0,0]
[null,null,null,null,null,null,0,0,0,0,0]
[null,null,null,null,null,null,0,0,0,0,0]
[null,null,null,null,null,null,0,0,0,0,0]
[null,null,null,null,null,null,0,0,0,0,0]
[null,null,null,null,null,null,0,0,0,0,0]
[null,null,null,null,null,null,0,0,0,0,0]
[null,null,null,null,null,null,0,0,0,0,0]
[null,null,null,null,null,null,0,0,0,0,0]
[null,null,null,null,null,null,0,0,0,0,0]
[null,null,null,null,null,null,0,0,0,0,0]
[null,null,null,null,null,null,0,0,0,0,0]
[null,null,null,null,null,null,0,0,0,0,0]
[null,null,null,null,null,null,0,0,0,0,0]
[null,null,null,null,null,null,0,0,0,0,0]
[null,null,null,null,null,null,0,0,0,0,0]
[null,null,null,null,null,null,0,0,0,0,0]
[null,null,null,null,null,null,0,0,0,0,0]
[null,null,null,null,null,null,0,0,0,0,0]
[null,null,null,null,null,null,0,0,0,0,0]
[null,null,null,null,null,null,0,0,0,0,0]
[null,null,null,null,null,null,0,0,0,0,0]
[null,null,null,null,null,null,0,0,0,0,0]
[null,null,null,null,null,null,0,0,0,0,0]
[null,null,null,null,null,null,0,0,0,0,0]
[null,null,null,null,null,null,0,0,0,0,0]
[null,null,null,null,null,null,0,0,0,0,0]
[null,null,null,null,null,null,0,0,0,0,0]
[null,null,null,null,null,null,0,0,0,0,0]
[null,null,null,null,null,null,0,0,0,0,0]
[null,null,null,null,null,null,0,0,0,0,0]
[null,null,null,null,null,null,0,0,0,0,0]
[null,null,null,null,null,null,0,0,0,0,0]
[null,null,null,null,null,null,0,0,0,0,0]
[null,null,null,null,null,null,0,0,0,0,0]
[null,null,null,null,null,null,0,0,0,0,0]
[null,null,null,null,null,null,0,0,0,0,0]
[null,null,null,null,null,null,0,0,0,0,0,null,null,null,null,null,null,null,null,null,null,null,null,null,null,null,null,null,null,0]
[null,null,null,null,null,null,0,0,0,0,0,null,null,null,null,null,null,null,null,null,null,null,null,null,null,null,null,null,null,0]
[null,null,null,null,null,null,0,0,0,0,0,null,null,null,null,null,null,null,null,null,null,null,null,null,null,null,null,null,null,0]
[null,null,null,null,null,null,0,0,0,0,0,null,null,null,null,null,null,null,null,null,null,null,null,null,null,null,null,null,null,0]
[null,null,null,null,null,null,0,0,0,0,0,null,null,null,null,null,null,null,null,null,null,null,null,null,null,null,null,null,null,0]
[null,null,null,null,null,null,0,0,0,0,0,null,null,null,null,null,null,null,null,null,null,null,null,null,null,null,null,null,null,0]
[null,null,null,null,null,null,0,0,0,0,0,null,null,null,null,null,null,null,null,null,null,null,null,null,null,null,null,null,null,0]
[null,null,null,null,null,null,0,0,0,0,0,null,null,null,null,null,null,null,null,null,null,null,null,null,null,null,null,null,null,0]
[null,null,null,null,null,null,0,0,0,0,0,null,null,null,null,null,null,null,null,null,null,null,null,null,null,null,null,null,null,0]
[null,null,null,null,null,null,0,0,0,0,0,null,null,null,null,null,null,null,null,null,null,null,null,null,null,null,null,null,null,0]
[null,null,null,null,null,null,0,0,0,0,0,null,null,null,null,null,null,null,null,null,null,null,null,null,null,null,null,null,null,0]
[null,null,null,null,null,null,0,0,0,0,0,null,null,null,null,null,null,null,null,null,null,null,null,null,null,null,null,null,null,0]
[null,null,null,null,null,null,0,0,0,0,0,null,null,null,null,null,null,null,null,null,null,null,null,null,null,null,null,null,null,0]
[null,null,null,null,null,null,{"$f":"AU72/$AS$6","v":0},{"$f":"AV72/$AS$6","v":0},{"$f":"AW72/$AS$6","v":0},{"$f":"AX72/$AS$6","v":0},{"$f":"AY72/$AS$6","v":0},null,null,null,null,null,null,null,null,null,null,null,null,null,null,null,null,null,null,0]
[null,null,null,null,null,null,0,0,0,0,0,null,null,null,null,null,null,null,null,null,null,null,null,null,null,null,null,null,null,0]
[null,null,null,null,null,null,0,0,0,0,0,null,null,null,null,null,null,null,null,null,null,null,null,null,null,null,null,null,null,0]
[null,null,null,null,null,null,0,0,0,0,0,null,null,null,null,null,null,null,null,null,null,null,null,null,null,null,null,null,null,0]
[null,null,null,null,null,null,0,0,0,0,0,null,null,null,null,null,null,null,null,null,null,null,null,null,null,null,null,null,null,0]
[null,null,null,null,null,null,0,0,0,0,0,null,null,null,null,null,null,null,null,null,null,null,null,null,null,null,null,null,null,0]
[null,null,null,null,null,null,0,0,0,0,0,null,null,null,null,null,null,null,null,null,null,null,null,null,null,null,null,null,null,0]
[null,null,null,null,null,null,0,0,0,0,0,null,null,null,null,null,null,null,null,null,null,null,null,null,null,null,null,null,null,0]
[null,null,null,null,null,null,0,0,0,0,0,null,null,null,null,null,null,null,null,null,null,null,null,null,null,null,null,null,null,0]
[null,null,null,null,null,null,0,0,0,0,0,null,null,null,null,null,null,null,null,null,null,null,null,null,null,null,null,null,null,0]
[null,null,null,null,null,null,0,0,0,0,0,null,null,null,null,null,null,null,null,null,null,null,null,null,null,null,null,null,null,0]
[null,null,null,null,null,null,0,0,0,0,0,null,null,null,null,null,null,null,null,null,null,null,null,null,null,null,null,null,null,0]
[null,null,null,null,null,null,0,0,0,0,0,null,null,null,null,null,null,null,null,null,null,null,null,null,null,null,null,null,null,0]
[null,null,null,null,null,null,0,0,0,0,0,null,null,null,null,null,null,null,null,null,null,null,null,null,null,null,null,null,null,0]
[null,null,null,null,null,null,0,0,0,0,0,null,null,null,null,null,null,null,null,null,null,null,null,null,null,null,null,null,null,0]
[null,null,null,null,null,null,0,0,0,0,0,null,null,null,null,null,null,null,null,null,null,null,null,null,null,null,null,null,null,0]
[null,null,null,null,null,null,0,0,0,0,0,null,null,null,null,null,null,null,null,null,null,null,null,null,null,null,null,null,null,0]
[null,null,null,null,null,null,0,0,0,0,0,null,null,null,null,null,null,null,null,null,null,null,null,null,null,null,null,null,null,0]
[null,null,null,null,null,null,0,0,0,0,0,null,null,null,null,null,null,null,null,null,null,null,null,null,null,null,null,null,null,0]
[null,null,null,null,null,null,0,0,0,0,0,null,null,null,null,null,null,null,null,null,null,null,null,null,null,null,null,null,null,0]
[null,null,null,null,null,null,0,0,0,0,0,null,null,null,null,null,null,null,null,null,null,null,null,null,null,null,null,null,null,0]
[null,null,null,null,null,null,0,0,0,0,0,null,null,null,null,null,null,null,null,null,null,null,null,null,null,null,null,null,null,0]
[null,null,null,null,null,null,0,0,0,0,0,null,null,null,null,null,null,null,null,null,null,null,null,null,null,null,null,null,null,0]
[null,null,null,null,null,null,0,0,0,0,0,null,null,null,null,null,null,null,null,null,null,null,null,null,null,null,null,null,null,0]
[null,null,null,null,null,null,0,0,0,0,0,null,null,null,null,null,null,null,null,null,null,null,null,null,null,null,null,null,null,0]
[null,null,null,null,null,null,0,0,0,0,0,null,null,null,null,null,null,null,null,null,null,null,null,null,null,null,null,null,null,0]
[null,null,null,null,null,null,0,0,0,0,0,null,null,null,null,null,null,null,null,null,null,null,null,null,null,null,null,null,null,0]
[null,null,null,null,null,null,0,0,0,0,0,null,null,null,null,null,null,null,null,null,null,null,null,null,null,null,null,null,null,0]
[null,null,null,null,null,null,0,0,0,0,0,null,null,null,null,null,null,null,null,null,null,null,null,null,null,null,null,null,null,0]
[null,null,null,null,null,null,0,0,0,0,0,null,null,null,null,null,null,null,null,null,null,null,null,null,null,null,null,null,null,0]
[null,null,null,null,null,null,0,0,0,0,0,null,null,null,null,null,null,null,null,null,null,null,null,null,null,null,null,null,null,0]
[null,null,null,null,null,null,0,0,0,0,0,null,null,null,null,null,null,null,null,null,null,null,null,null,null,null,null,null,null,0]
[null,null,null,null,null,null,0,0,0,0,0,null,null,null,null,null,null,null,null,null,null,null,null,null,null,null,null,null,null,0]
[null,null,null,null,null,null,0,0,0,0,0,null,null,null,null,null,null,null,null,null,null,null,null,null,null,null,null,null,null,0]
[null,null,null,null,null,null,0,0,0,0,0,null,null,null,null,null,null,null,null,null,null,null,null,null,null,null,null,null,null,0]
[null,null,null,null,null,null,0,0,0,0,0,null,null,null,null,null,null,null,null,null,null,null,null,null,null,null,null,null,null,0]
[null,null,null,null,null,null,0,0,0,0,0,null,null,null,null,null,null,null,null,null,null,null,null,null,null,null,null,null,null,0]
[null,null,null,null,null,null,0,0,0,0,0,null,null,null,null,null,null,null,null,null,null,null,null,null,null,null,null,null,null,0]
[null,null,null,null,null,null,0,0,0,0,0,null,null,null,null,null,null,null,null,null,null,null,null,null,null,null,null,null,null,0]
[null,null,null,null,null,null,0,0,0,0,0]
[null,"Percentage",null,null,null,null,{"$f":"G111/K111","v":{"$error":"#DIV/0!"}},{"$f":"H111/K111","v":{"$error":"#DIV/0!"}},null,null,{"$f":"G112+H112","v":{"$error":"#DIV/0!"}}]
[null,"Averages",null,null,null,null,"Base","Increm","Non-Promoted","Promoted","Total",null," Averages",null,null,null,"Base","Increm",null,"Total"]
[null,"Latest 1 Wk",null,null,null,null,{"$f":"G110","v":0},{"$f":"H110","v":0},{"$f":"I110","v":0},{"$f":"J110","v":0},{"$f":"G114+H114","v":0},null,{"$f":"M110","v":0},{"$f":"N110","v":0},null,null,{"$f":"IF(G58<=0,\"-\",(G110-G58)/G58)","v":"-"},{"$f":"IF(H58<=0,\"-\",(H110-H58)/H58)","v":"-"},null,{"$f":"IF(K58<=0,\"-\",(K110-K58)/K58)","v":"-"}]
[null,"Latest 4 Wks",null,null,null,null,{"$f":"AVERAGE(G107:G110)","v":0},{"$f":"AVERAGE(H107:H110)","v":0},{"$f":"AVERAGE(I107:I110)","v":0},{"$f":"AVERAGE(J107:J110)","v":0},0,null,{"$f":"IF(SUM(M107:M110)<>0,SUM(M107:M110)/COUNTIF(M107:M110,\">0\"),\"NA\")","v":"NA"},{"$f":"IF(SUM(N107:N110)<>0,SUM(N107:N110)/COUNTIF(N107:N110,\">0\"),\"NA\")","v":"NA"},null,null,{"$f":"IF(SUM(G55:G58)<=0,\"-\",(SUM(G107:G110)-SUM(G55:G58))/SUM(G55:G58))","v":"-"},{"$f":"IF(SUM(H55:H58)<=0,\"-\",(SUM(H107:H110)-SUM(H55:H58))/SUM(H55:H58))","v":"-"},null,{"$f":"IF(SUM(K55:K58)<=0,\"-\",(SUM(K107:K110)-SUM(K55:K58))/SUM(K55:K58))","v":"-"}]
[null,"Latest 12 Wks",null,null,null,null,{"$f":"AVERAGE(G99:G110)","v":0},{"$f":"AVERAGE(H99:H110)","v":0},{"$f":"AVERAGE(I99:I110)","v":0},{"$f":"AVERAGE(J99:J110)","v":0},0,null,{"$f":"IF(SUM(M99:M110)<>0,SUM(M99:M110)/COUNTIF(M99:M110,\">0\"),\"NA\")","v":"NA"},{"$f":"IF(SUM(N99:N110)<>0,SUM(N99:N110)/COUNTIF(N99:N110,\">0\"),\"NA\")","v":"NA"},null,null,{"$f":"IF(SUM(G47:G58)<=0,\"-\",(SUM(G99:G110)-SUM(G47:G58))/SUM(G47:G58))","v":"-"},{"$f":"IF(SUM(H47:H58)<=0,\"-\",(SUM(H99:H110)-SUM(H47:H58))/SUM(H47:H58))","v":"-"},null,{"$f":"IF(SUM(K47:K58)<=0,\"-\",(SUM(K99:K110)-SUM(K47:K58))/SUM(K47:K58))","v":"-"}]
[null,"Latest 26 Wks",null,null,null,null,{"$f":"AVERAGE(G85:G110)","v":0},{"$f":"AVERAGE(H85:H110)","v":0},{"$f":"AVERAGE(I85:I110)","v":0},{"$f":"AVERAGE(J85:J110)","v":0},0,null,{"$f":"IF(SUM(M85:M110)<>0,SUM(M85:M110)/COUNTIF(M85:M110,\">0\"),\"NA\")","v":"NA"},{"$f":"IF(SUM(N85:N110)<>0,SUM(N85:N110)/COUNTIF(N85:N110,\">0\"),\"NA\")","v":"NA"},null,null,{"$f":"IF(SUM(G33:G58)<=0,\"-\",(SUM(G85:G110)-SUM(G33:G58))/SUM(G33:G58))","v":"-"},{"$f":"IF(SUM(H33:H58)<=0,\"-\",(SUM(H85:H110)-SUM(H33:H58))/SUM(H33:H58))","v":"-"},null,{"$f":"IF(SUM(K33:K58)<=0,\"-\",(SUM(K85:K110)-SUM(K33:K58))/SUM(K33:K58))","v":"-"},null,null,null,null,null,"Non-Promoted Cases",null,null,null,{"$f":"Z117","v":"Non-Promoted Cases"}]
[null,"Latest 52 Wks",null,null,null,null,{"$f":"AVERAGE(G59:G110)","v":0},{"$f":"AVERAGE(H59:H110)","v":0},{"$f":"AVERAGE(I59:I110)","v":0},{"$f":"AVERAGE(J59:J110)","v":0},0,null,{"$f":"IF(SUM(M59:M110)<>0,SUM(M59:M110)/COUNTIF(M59:M110,\">0\"),\"NA\")","v":"NA"},{"$f":"IF(SUM(N59:N110)<>0,SUM(N59:N110)/COUNTIF(N59:N110,\">0\"),\"NA\")","v":"NA"},null,null,{"$f":"IF(SUM(G7:G58)<=0,\"-\",(SUM(G59:G110)-SUM(G7:G58))/SUM(G7:G58))","v":"-"},{"$f":"IF(SUM(H7:H58)<=0,\"-\",(SUM(H59:H110)-SUM(H7:H58))/SUM(H7:H58))","v":"-"},null,{"$f":"IF(SUM(K7:K58)<=0,\"-\",(SUM(K59:K110)-SUM(K7:K58))/SUM(K7:K58))","v":"-"},null,null,null,null,null,"Promoted Cases",null,null,null,{"$f":"Z118","v":"Promoted Cases"}]
[null,"Latest 78 Wks",null,null,null,null,{"$f":"AVERAGE(G33:G110)","v":0},{"$f":"AVERAGE(H33:H110)","v":0},{"$f":"AVERAGE(I33:I110)","v":0},{"$f":"AVERAGE(J33:J110)","v":0},0,null,{"$f":"IF(SUM(M33:M110)<>0,SUM(M33:M110)/COUNTIF(M33:M110,\">0\"),\"NA\")","v":"NA"},{"$f":"IF(SUM(N33:N110)<>0,SUM(N33:N110)/COUNTIF(N33:N110,\">0\"),\"NA\")","v":"NA"},null,null,null,null,null,null,null,null,null,null,null,null,null,null,null,"Avg Price/Unit"]
[null,"Latest 104 Wks",null,null,null,null,{"$f":"AVERAGE(G7:G110)","v":0},{"$f":"AVERAGE(H7:H110)","v":0},{"$f":"AVERAGE(I7:I110)","v":0},{"$f":"AVERAGE(J7:J110)","v":0},0,null,{"$f":"IF(SUM(M7:M110)<>0,SUM(M7:M110)/COUNTIF(M7:M110,\">0\"),\"NA\")","v":"NA"},{"$f":"IF(SUM(N7:N110)<>0,SUM(N7:N110)/COUNTIF(N7:N110,\">0\"),\"NA\")","v":"NA"}]

{"sheet":"Graph","index":1,"n_rows":6,"n_cols":6,"rows_kept":6,"cut":false,"hidden":false,"merged":[]}
[]
[]
[]
[null,"Product:","RICE-PASTA-ETHNIC SPECIALTIES",null,null,"Non-Promoted Cases"]
[null,"Time:","Latest 52 Weeks",null,null,"Promoted Cases"]
[null,"Geography:",null,null,null,"% ACV Any Display"]

{"sheet":"ddlb_Control","index":2,"n_rows":3,"n_cols":6,"rows_kept":3,"cut":false,"hidden":true,"merged":[]}
["Time","Selected",null,1,null,1]
["Latest 52 Weeks",1]
["YA 52 Weeks"]

{"sheet":"<RGT.Sheet_info.dim2>","index":3,"n_rows":2,"n_cols":7,"rows_kept":2,"cut":false,"hidden":true,"merged":[]}
[null,null,null,null,null,null,{"$f":"MID(Picture!A1,13,30)","v":null}]
[null,null,null,null,null,null,1]

{"sheet":"MEAS LAYOUT","index":4,"n_rows":109,"n_cols":33,"rows_kept":109,"cut":false,"hidden":true,"merged":[]}
["Week","Dol Sales","Units","Units Any Merch","Units No Merch","Base Cases","Incremental Cases","Non-Promoted Cases","Promoted Cases","Total Cases","Avg Price/Unit","Avg Price per Unit - No Merch","Avg Price Any Merch","% Lift","ACV Wtd Dist.","% ACV Any Merch","%ACV Any Feature","% ACV Front Page Feature","% ACV Any Display","% ACV Feat & Display","Num of Displays ","Num of Disp Chg YAG","Num of Disp % Chg YAG","Inv on Display Cases","Inv on Disp Chg YAG","Inv on Disp % Chg YAG","Column AB",null,null," Michael Jordan SKU's","XLCACSANNC7963P11",null,"TOTAL US - GROC"]
["WkE 05/23/10",124321.6,73818.26,46096.2874755859,27721.9703369141,3935.25390625,2216.267578125,2310.16419474284,3841.35728963216,6151.521484375,1.6842,1.9312,1.5356,0.5632,70.6786,35.2239,4.4273,0,10.5051,0.9652,2150.2781,2150.27807617187,null,3397.432,3397.43212890625,null,1.68415757576912,null,null," Ttl Gatorade & Tiger SPDK 32oz1ct C-store","XLCACSANNC7963P12",null,12]
["WkE 05/30/10",120105.4,68570.62,38147.1136474609,30423.5035400391,4217.06966145833,1497.1484375,2535.29196166992,3178.92613728841,5714.21809895833,1.7516,1.9391,1.602,0.355,72.274,33.057,3.9901,0,5.1286,0.3268,1400.8059,1400.80590820312,null,1902.818,1902.818359375,null,1.75155744437275,null,null,"+GATRD ASST TQNCH 12CT     240OZ 5200020162","P553"]
["WkE 06/06/10",120107.7,66856.31,29210.2866821289,37646.0258178711,4536.31998697917,1035.03938802083,3137.16881815592,2434.19055684408,5571.359375,1.7965,1.9545,1.5929,0.2282,72.0011,24.1392,1.5767,0,4.9887,0.1156,1367.884,1367.88403320313,null,1734.25,1734.24951171875,null,1.79650528512173,null,null,"+GATRD ASST TQNCH 18CT     216OZ 5200012324","P224"]
[]
[]
[]
[]
[]
[]
[]
[]
[]
[]
[]
[]
[]
[]
[]
[]
[]
[]
[]
[]
[]
[]
[]
[]
[]
[]
[]
[]
[]
[]
[]
[]
[]
[]
[]
[]
[]
[]
[]
[]
[]
[]
[]
[]
[]
[]
[]
[]
[]
[]
[]
[]
[]
[]
[]
[]
[]
[]
[]
[]
[]
[]
[]
[]
[]
[]
[]
[]
[]
[]
[]
[]
[]
[]
[]
[]
[]
[]
[]
[]
[]
[]
[]
[]
[]
[]
[]
[]
[]
[]
[]
[]
[]
[]
[]
[]
[]
[]
[]
[]
[]
[]
[null,null,null,null,null,null,null,null,null,null,null,null,null,null,null,null,null,null,null,null,null,null,null,null,null,null,null,null,null,"Ttl Powerade 12oz 10ct inc Zero","XLCACSANNC7963P13"]
[null,null,null,null,null,null,null,null,null,null,null,null,null,null,null,null,null,null,null,null,null,null,null,null,null,null,null,null,null,"Ttl QTG Spdk 12oz 12ct","XLCACSANNC7963P17"]
[null,null,null,null,null,null,null,null,null,null,null,null,null,null,null,null,null,null,null,null,null,null,null,null,null,null,null,null,null,"Ttl QTG Spdk 20oz 8ct","XLCACSANNC7963P14"]

{"sheet":"Case-pack","index":5,"n_rows":427,"n_cols":7,"rows_kept":427,"cut":false,"hidden":true,"merged":[]}
[{"$f":"OFFSET(ProdList,ddlb_Control!D1-1,0)","v":0},{"$f":"MATCH(A1,D:D,0)","v":{"$error":"#N/A"}},null,"SPORTS DRINKS",1,1,"SD"]
[null,{"$f":"MATCH(A1,ddlb_Control!C:C,0)-1","v":{"$error":"#N/A"}},null,"SD TOTAL GATORADE SD",1]
[null,null,null,"SD GATORADE THIRST QUENCHER",1]
[null,null,null,"SD 12 OZ 6 CT PLBTL TOTAL GATORADE SD",1]
[null,null,null,"SD 12 OZ 12 CT PLBTL TOTAL GATORADE SD",1]
[null,null,null,"SD 12 OZ 18 CT PLBTL TOTAL GATORADE SD",1]
[null,null,null,"Ttl Gatorade 12 oz All Count_22.0",1]
[null,null,null,"SD 20 OZ 1 CT PLBTL TOTAL GATORADE SD",1]
[null,null,null,"SD 20 OZ 8 CT PLBTL TOTAL GATORADE SD",1]
[null,null,null,"TTL GAT SPDK 32OZ 28OZ 1CT_22.0",1]
[null,null,null,"SD 28 OZ 1 CT PLBTL TOTAL GATORADE SD",1]
[null,null,null,"SD 32 OZ 1 CT PLBTL TOTAL GATORADE SD",1]
[null,null,null,"Ttl Gatorade 32 oz All Count_22.0",1]
[null,null,null,"SD 64 OZ 1 CT PLBTL TOTAL GATORADE SD",1]
[null,null,null,"SD GTRD THIRST QENCHER 128 OZ (1G) 1 CT PLASTIC BOTTLE",1]
[null,null,null,"Total QTG SPDK Bulk Powder_22.0",1]
[null,null,null,"SD 768 OZ (6G) 1 CT CNSTR TOTAL GATORADE SD",1]
[null,null,null,"Total Gatorade Prime_22.0",1]
[null,null,null,"SD GATORADE PRIME",1]
[null,null,null,"EN CH GATORADE PRIME",1]
[null,null,null,"Prime bars_22.0",1]
[null,null,null,"Total Gatorade Recover_22.0",1]
[null,null,null,"Gatorade Recover Shakes_22.0",1]
[null,null,null,"GAT Recover Bars_22.0",1]
[null,null,null,"SD G2",1]
[null,null,null,"SD TOTAL GATORADE SD GATORADE FROST",1]
[null,null,null,"SD TOTAL GATORADE SD GATORADE FIERCE",1]
[null,null,null,"Total Gatorade Flavors From Home_22.0",1]
[null,null,null,"SD TOTAL GATORADE SD GATORADE MAINLINE",1]
[null,null,null,"SD COCA COLA",1]
[null,null,null,"SD POWERADE BASE",1]
[null,null,null,"SD POWERADE ZERO",1]
[null,null,null,"SD 32 OZ 1 CT PLBTL POWERADE",1]
[null,null,null,"SD 20 OZ 8 CT PLBTL POWERADE",1]
[null,null,null,"SD 12 OZ 12 CT PLBTL POWERADE",1]
[null,null,null,"SD BODYARMOR NUTRITION",1]
[null,null,null,"ENHANCED NJSW (ENJSW)",1,null,"Propel"]
[null,null,null,"ENJSW PROPEL",1]
[null,null,null,"ENJSW PROPEL ZERO RTD",1]
[null,null,null,"ENJSW 16.9 OZ 6 CT PLBTL PROPEL",1]
[null,null,null,"ENJSW 16.9 OZ 12 CT PLBTL PROPEL",1]
[null,null,null,"TTL PROPEL 23.7/24Z 1CT_22.0",1]
[null,null,null,"ENJSW PROPEL ZERO POWDER",1]
[null,null,null,"ENJSW PROPEL ELECTROLYTE WATER",1]
[null,null,null,"ENJSW PROPL ECTRLYTE WTR 16.9 OZ",1]
[null,null,null,"ENJSW PROPL ECTRLYTE WTR 25.4 OZ 1 CT PLASTIC BOTTLE",1]
[null,null,null,"ENJSW PROPL ECTRLYTE WTR 25.4 OZ 6 CT PLASTIC BOTTLE",1]
[null,null,null,"ENJSW PCNA",1]
[null,null,null,"ENJSW SOBE LIFEWATER",1]
[null,null,null,"ENJSW AQUAFINA",1]
[null,null,null,"TTL PCNA ENJSW SINGLE SERVE_22.0",1]
[null,null,null,"TTL GLACEAU ENJSW_22.0",1]
[null,null,null,"ENJSW GLACEAU VITAMIN WATER",1]
[null,null,null,"ENJSW GLACEAU SMART WATER",1]
[null,null,null,"ENJSW GLC SMRT WTR 16.9 OZ 6 CT",1]
[null,null,null,"ENJSW GLC SMRT WTR 20 OZ",1]
[null,null,null,"ENJSW GLC SMRT WTR 23.7 OZ",1]
[null,null,null,"ENJSW GLC SMRT WTR 33.8 OZ (1L) 6 CT",1]
[null,null,null,"ENJSW GLC SMRT WTR 33.8 OZ (1L) 12 CT",1]
[null,null,null,"ENJSW GLC SMRT WTR 50.7 OZ (1.5L)",1]
[null,null,null,"TTL GLACEAU ENJSW SINGLE SERVE_22.0",1]
[null,null,null,"Ttl Glaceau Vitamin+Smart Water 20oz 1ct_22.0",1]
[null,null,null,"Ttl Glaceua 32oz and larger_22.0",1]
[null,null,null,"ENJSW NESTLE PURE LIFE",1]
[null,null,null,"ENJSW PRIVATE LABEL",1]
[null,null,null,"SPARKLING/SELTZER WATER",1]
[null,null,null,"SPKW/SLTZ SPARKLING ICE",1]
[null,null,null,"SPKW/SLTZ GLACEAU FRUIT WATER",1]
[null,null,null,"SPKW/SLTZ PERRIER",1]
[null,null,null,"SPKW/SLTZ SAN PELLEGRINO",1]
[null,null,null,"SPKW/SLTZ LA CROIX",1]
[null,null,null,"SPKW/SLTZ PRIVATE LABEL",1]
[null,null,null,"LITE SNACKS",1,null,"LS"]
[null,null,null,"LTSNCKS QTG",1]
[null,null,null,"Popped & Fiber Crisps Under 4oz_22.0",1]
[null,null,null,"Popped & Fiber Crisps Over 4oz_22.0",1]
[null,null,null,"LTSNCKS MOTHERS",1]
[null,null,null,"LTSNCKS QUAKER LARGE",1]
[null,null,null,"LTSNCKS QUAKER POPPED",1]
[null,null,null,"LTSNCKS PRIVATE LABEL",1]
[null,null,null,"LTSNCKS PL RICE CRISP",1]
[null,null,null,"LTSNCKS PL LARGE RICE/POPCORN",1]
[null,null,null,"LTSNCKS GENISOY",1]
[null,null,null,"LTSNCKS GENISOY SOY CRISPS",1]
[null,null,null,"LTSNCKS GENISOY",1]
[null,null,null,"RTE PPCRN FL CRACKER JACK",1]
[null,null,null,"Canisters_22.0",1]
[null,null,null,"Chewy TM 8ct_22.0",1]
[null,null,null,"Chewy TM 5ct_22.0",1]
[null,null,null,"Popped Core Multi-Packs_22.0",1]
[null,null,null,"TTL WHOLESOME SNACKS X EB FTP_22.0",1,null,"WS"]
[null,null,null,"TTL QTG WHLSM SNACKS X EB_22.0",1]
[null,null,null,"TTL KLGS WHLSM SNACKS X EBFTP_22.0",1]
[null,null,null,"TTL GM WHLSM SNACKS X EBFTP_22.0",1]
[null,null,null,"TTL PL WHLSM SNACKS X EBFTP_22.0",1]
[null,null,null,"PERFORMANCE AND DIET BARS",1]
[null,null,null,"SNACK BARS",1]
[null,null,null,"GRANOLA BAR",1]
[null,null,null,"CEREAL BAR",1]
[null,null,null,"TREAT BAR",1]
[null,null,null,"OTHER SNACK BAR",1]
[null,null,null,"SNACK BARS QTG",1]
[null,null,null,"SNACK BARS QUAKER CHEWY",1]
[null,null,null,"SNACK BARS QUAKER CHEWY BARS",1]
[null,null,null,"Chewy - Big Chewy_22.0",1]
[null,null,null,"SNACK BARS QUAKER CHEWY 90 CALORIES",1]
[null,null,null,"SNACK BARS QUAKER CHEWY REDUCED SUGAR",1]
[null,null,null,"Quaker Chewy Yogurt (temp)_22.0",1]
[null,null,null,"Chewy - Dipps 6CT_22.0",1]
[null,null,null,"SNACK BARS 18 CT QUAKER CHEWY_22.0",1]
[null,null,null,"Chewy 14-18CT (Chewy + Dipps)_22.0",1]
[null,null,null,"Chewy Bars 8CT_22.0",1]
[null,null,null,"Quaker Premium Advantage_22.0",1]
[null,null,null,"SNACK BARS QUAKER PROTEIN",1]
[null,null,null,"Breakfast Flats_22.0",1]
[null,null,null,"SNACK BARS QUAKER REAL MEDLEYS",1]
[null,null,null,"SNACK BARS QUAKER SOFT BAKED",1]
[null,null,null,"SNACK BARS QUAKER OATMEAL TO GO",1]
[null,null,null,"SNACK BARS QUAKER QUINOA",1]
[null,null,null,"PERFORMANCE BARS GATORADE RECOVER",1]
[null,null,null,"SNACK BARS KELLOGG CO",1]
[null,null,null,"Total Kashi Snack Bars (temp)_22.0",1]
[null,null,null,"SNACK BARS KELLOGGS FIBER PLUS",1]
[null,null,null,"SNACK BARS KELLOGGS SPECIAL K",1]
[null,null,null,"SNACK BARS KELLOGGS NUTRI-GRAIN",1]
[null,null,null,"SNACK BARS KELLOGGS RICE KRISPIES TREATS",1]
[null,null,null,"SNACK BARS GENERAL MILLS",1]
[null,null,null,"SNACK BARS GENERAL MILLS NATURE VALLEY",1]
[null,null,null,"SNACK BARS GENERAL MILLS FIBER ONE",1]
[null,null,null,"SNACK BARS GENERAL MILLS MILK N CEREAL BARS",1]
[null,null,null,"SNACK BARS CASCADIAN FARM",1]
[null,null,null,"SNACK BARS SUNBELT",1]
[null,null,null,"SNACK BARS PRIVATE LABEL",1]
[null,null,null,"TOASTER PASTRIES",1]
[null,null,null,"TOASTER PASTRIES KELLOGG CO",1]
[null,null,null,"TOASTER PASTRIES PRIVATE LABEL",1]
[null,null,null,"FRUIT SNACKS",1]
[null,null,null,"FRUIT SNACKS GENERAL MILLS",1]
[null,null,null,"FRUIT SNACKS PRIVATE LABEL",1]
[null,null,null,"FRUIT SNACKS KELLOGG CO",1]
[null,null,null,"PERFORMANCE BARS CLIF",1]
[null,null,null,"PERFORMANCE BARS POWER BAR INC",1]
[null,null,null,"KELLOGGS SPECIAL K",1]
[null,null,null,"HOT CEREAL",1,null,"HOT Cereal"]
[null,null,null,"HTRCRL QTG",1]
[null,null,null,"HTRCRL QUAKER STANDARD OATMEAL",1]
[null,null,null,"SQO 18OZ_22.0",1]
[null,null,null,"SQO 42OZ_22.0",1]
[null,null,null,"SQO Steel Cut (temp)_22.0",1]
[null,null,null,"HTRCRL QUAKER INSTANT OATMEAL",1]
[null,null,null,"HTRCRL QTG INSTNT OTML IQO",1]
[null,null,null,"IQO Beige Box + Express_22.0",1]
[null,null,null,"HTRCRL QTG INSTNT OTML IQO BEIGE BOX",1]
[null,null,null,"HTRCRL QTG INSTNT OTML IQO LOW SUGAR",1]
[null,null,null,"IQO 8/10/12 Count_22.0",1]
[null,null,null,"IQO 18 Count_22.0",1]
[null,null,null,"IQO Variety Packs_22.0",1]
[null,null,null,"IQO Express + Express 50%_22.0",1]
[null,null,null,"IQO Base 6-12CT_22.0",1]
[null,null,null,"IQO Advantaged_22.0",1]
[null,null,null,"IQO ADVANTAGED 8ct_22.0",1]
[null,null,null,"IQO Advantaged 12CT (HF, WC, ORG, SC)_22.0",1]
[null,null,null,"IQO Adv 12ct (HF, ORG, SC)_22.0",1]
[null,null,null,"IQO Advantaged 6-8CT (X 2016 New Items)_22.0",1]
[null,null,null,"HTRCRL QTG INSTNT OTML IQO HIGH FIBER",1]
[null,null,null,"HTRCRL QTG INSTNT OTML IQO WEIGHT CONTROL",1]
[null,null,null,"HTRCRL QTG INSTNT OTML IQO ORGANIC",1]
[null,null,null,"HTRCRL QTG INSTNT OTML IQO PROTEIN",1]
[null,null,null,"HTRCRL QTG INSTNT OTML QUAKER WARM & CRUNCHY GRANOLA",1]
[null,null,null,"HTRCRL QTG INSTNT OTML QUAKER REAL MEDLEYS",1]
[null,null,null,"HTRCRL KELLOGG CO",1]
[null,null,null,"HTRCRL KASHI GO LEAN",1]
[null,null,null,"HTRCRL KASHI HEART TO HEART",1]
[null,null,null,"Special K Nourish (temp)_22.0",1]
[null,null,null,"HTRCRL GENERAL MILLS",1]
[null,null,null,"HTRCRL CHEX GLUTEN FREE",1]
[null,null,null,"HTRCRL NATURE VALLEY",1]
[null,null,null,"MOM Hot Cereal_22.0",1]
[null,null,null,"HTRCRL MALT-O-MEAL",1]
[null,null,null,"Total MOM Standard Hots_22.0",1]
[null,null,null,"Total MOM Instant Hots_22.0",1]
[null,null,null,"HTRCRL BETTER OATS",1]
[null,null,null,"HTRCRL B&G FOODS",1]
[null,null,null,"HTRCRL CREAM OF WHEAT",1]
[null,null,null,"HTRCRL BOBS RED MILL",1]
[null,null,null,"HTRCRL PRIVATE LABEL",1]
[null,null,null,"HTRCRL PL STANDARD",1]
[null,null,null,"PL Standard 18OZ_22.0",1]
[null,null,null,"PL Standard 42OZ_22.0",1]
[null,null,null,"HTRCRL PL INSTANT",1]
[null,null,null,"GRITS",1]
[null,null,null,"GRTS QTG",1]
[null,null,null,"GRTS QUAKER GRITS",1]
[null,null,null,"GRTS QUAKER GRITS INSTANT",1]
[null,null,null,"GRTS QTG GRITS POUCH",1]
[null,null,null,"Quaker Instant Grits 12oz_22.0",1]
[null,null,null,"Quaker Instant Grits 18oz Box_22.0",1]
[null,null,null,"GRTS QUAKER GRITS STANDARD",1]
[null,null,null,"QFS Reg Grits Tubes_22.0",1]
[null,null,null,"GRTS QUAGRIST NA 1 CT REGUPLAI 36.8 OZ",1]
[null,null,null,"GRTS QUAGRIST NA 1 CT REGUPLAI 24 OZ",1]
[null,null,null,"GRTS QUAGRIST NA 1 CT REGUPLAI 80 OZ",1]
[null,null,null,"GRTS AUNT JEMIMA",1]
[null,null,null,"GRTS JIM DANDY",1]
[null,null,null,"GRTS PRIVATE LABEL",1]
[null,null,null,"RTE CEREAL",1,null,"RTE"]
[null,null,null,"CORE BREAKFAST RTECRL KIDS QTG",1]
[null,null,null,"CORE BREAKFAST RTECRL ALL FAMILY QTG",1]
[null,null,null,"CORE BREAKFAST RTECRL ADULT QTG",1]
[null,null,null,"CORE BREAKFAST RTECRL RTE GRNLA QTG",1]
[null,null,null,"RTECRL QTG",1]
[null,null,null,"RTECRL QUAKER CAP'N CRUNCH (ALL)",1]
[null,null,null,"Crunch Small Box_22.0",1]
[null,null,null,"Crunch Large Box x Bonus_22.0",1]
[null,null,null,"Crunch 28oz_22.0",1]
[null,null,null,"RTECRL QUAKER LIFE (ALL)",1]
[null,null,null,"Life Small Box_22.0",1]
[null,null,null,"Life Large Box x Bonus_22.0",1]
[null,null,null,"RTECRL QUAKER OATMEAL SQUARES (ALL)",1]
[null,null,null,"QOS Small Box x Bonus_22,0",1]
[null,null,null,"QOS Large Box_22.0",1]
[null,null,null,"Total RTE Cups_22.0",1]
[null,null,null,"QKR CNC Cups_22.0",1]
[null,null,null,"QKR Life Cups_22.0",1]
[null,null,null,"RTECRL QUAKER REAL MEDLEYS",1]
[null,null,null,"Real Medley RTE Crn_Almnd Summr_Bry_22.0",1]
[null,null,null,"Real Medley RTE Bx_22.0",1]
[null,null,null,"Real Medley RTE Bg_22.0",1]
[null,null,null,"Real Medley Yogurt cups_22.0",1]
[null,null,null,"Quaker Simply Granola (temp)_22.0",1]
[null,null,null,"QNC Small Box X Bonus_22.0",1]
[null,null,null,"MOM Brands RTE_22.0",1]
[null,null,null,"RTECRL GENERAL MILLS",1]
[null,null,null,"RTECRL GENERAL MILLS CHEERIOS (ALL)",1]
[null,null,null,"RTECRL GENERAL MILLS HONEY NUT CHEERIOS",1]
[null,null,null,"RTECRL GENERAL MILLS WHEATIES (ALL)",1]
[null,null,null,"RTECRL GENERAL MILLS TOTAL (ALL)",1]
[null,null,null,"RTECRL GENERAL MILLS CHEX (ALL)",1]
[null,null,null,"RTECRL GENERAL MILLS FIBER ONE",1]
[null,null,null,"RTECRL GENERAL MILLS LUCKY CHARMS (ALL)",1]
[null,null,null,"RTECRL GENERAL MILLS CINNAMON TST CRNCH",1]
[null,null,null,"RTECRL GENERAL MILLS COCOA PUFFS",1]
[null,null,null,"RTECRL GENERAL MILLS REESES PUFFS",1]
[null,null,null,"RTECRL GENERAL MILLS KIX (ALL)",1]
[null,null,null,"RTECRL GENERAL MILLS TRIX",1]
[null,null,null,"RTECRL KELLOGG CO",1]
[null,null,null,"RTECRL KELLOGGS ALL-BRAN (ALL)",1]
[null,null,null,"RTECRL KASHI (ALL)",1]
[null,null,null,"RTECRL KELLOGGS APPLE JACKS (ALL)",1]
[null,null,null,"RTECRL KELLOGGS FROOT LOOPS (ALL)",1]
[null,null,null,"RTECRL KELLOGGS CORN FLAKES (ALL)",1]
[null,null,null,"RTECRL KELLOGGS CORN POPS (ALL)",1]
[null,null,null,"RTECRL KELLOGGS CRISPIX (ALL)",1]
[null,null,null,"RTECRL KELLOGGS FROSTED FLAKES (ALL)",1]
[null,null,null,"Kelloggs Raisin Bran (temp)_22.0",1]
[null,null,null,"RTECRL KELLOGGS RICE KRISPIES (ALL)",1]
[null,null,null,"RTECRL KELLOGGS FROSTED MINI-WHEATS (ALL)",1]
[null,null,null,"RTECRL KELLOGGS SMACKS",1]
[null,null,null,"RTECRL KELLOGGS SPECIAL K (ALL)",1]
[null,null,null,"RTECRL KELLOGGS SMART START (ALL)",1]
[null,null,null,"RTECRL POST HOLDINGS INC",1]
[null,null,null,"RTECRL POST HONEY BUNCHES OF OATS (ALL)",1]
[null,null,null,"RTECRL POST PEBBLES (ALL)",1]
[null,null,null,"RTECRL POST SHREDDED WHEAT (ALL)",1]
[null,null,null,"RTECRL POST GRAPE NUTS (ALL)",1]
[null,null,null,"RTECRL POST PREMIUM RAISIN BRAN",1]
[null,null,null,"RTECRL POST HONEYCOMB",1]
[null,null,null,"RTECRL PRIVATE LABEL",1]
[null,null,null,"RICE-PASTA-ETHNIC SPECIALTIES",1,null,"Rice Pasta"]
[null,null,null,"Total Quaker Grains_22.0",1]
[null,null,null,"Total RAR/PAR_22.0",1]
[null,null,null,"FLVRCMXS RICE A RONI",1]
[null,null,null,"RAR Regular Size_22.0",1]
[null,null,null,"RAR Family Size_22.0",1]
[null,null,null,"FLVRCMXS RICE A RONI RUSTIC RECIPES",1]
[null,null,null,"RAR Cups_22.0",1]
[null,null,null,"RAR Quick Serve (temp)_22.0",1]
[null,null,null,"Pasta Roni (temp)_22.0",1]
[null,null,null,"Pasta Roni Regular Size_22.0",1]
[null,null,null,"Pasta Roni Family Size_22.0",1]
[null,null,null,"FLVPSTA PASTA RONI RUSTIC RECIPES",1]
[null,null,null,"Total Near East_22.0",1]
[null,null,null,"FLVRCMXS NEAR EAST",1]
[null,null,null,"FLVRCMXS NEAR EAST PILAF",1]
[null,null,null,"Near East Pilaf 6pk_22.0",1]
[null,null,null,"ETHNCSPCLTS NEAR EAST",1]
[null,null,null,"ETHNCSPCLTS NEAR EAST COUSCOUS",1]
[null,null,null,"FLVPSTA NEAR EAST",1]
[null,null,null,"FLVRCMXS UNCLE BENS",1]
[null,null,null,"FLVRCMXS UNCLE BENS READY RICE",1]
[null,null,null,"FLVRCMXS UNCLE BENS COUNTRY INN",1]
[null,null,null,"FLVRCMXS UNCLE BENS FLAVORED GRAINS",1]
[null,null,null,"FLVRCMXS UNCLE BENS READY WHOLE GRAIN MEDLEY",1]
[null,null,null,"Total Knorr Grains_22.0",1]
[null,null,null,"FLVRCMXS KNORR LIPTON",1]
[null,null,null,"FLVPSTA KNORR LIPTON",1]
[null,null,null,"FLVRCMXS ZATARAINS",1]
[null,null,null,"FLVRCMXS GOYA",1]
[null,null,null,"All Other Flvd. Rice, Pasta & ES_22.0",1]
[null,null,null,"FLVRCMXS PRIVATE LABEL",1]
[null,null,null,"FLVPSTA PRIVATE LABEL",1]
[null,null,null,"TTL CHLD J/JD (INCL. SP)_22.0",1,null,"Chilled"]
[null,null,null,"TTL CHLD J/JD (EXCL. SP)_22.0",1]
[null,null,null,"TTL QTG CHLD J/JD (INCL. SP)_22.0",1]
[null,null,null,"TTL QTG CHLD J/JD (EXCL. SP)_22.0",1]
[null,null,null,"TTL BRD TROP CHLD J/JD (INCL SP)_22.0",1]
[null,null,null,"TTL TROP 50_22.0",1]
[null,null,null,"TTL BRD TPP CHLD J/JD (INCL SP)_22.0",1]
[null,null,null,"TTL BRAND DOLE CHLD J/JD_22.0",1]
[null,null,null,"TTL COKE CHLD J/JD (INCL. SP)_22.0",1]
[null,null,null,"TTL COKE CHLD J/JD (EXCL. SP)_22.0",1]
[null,null,null,"TTL BRAND SIMPLY CHLD J/JD_22.0",1]
[null,null,null,"TTL BRAND MINUTE MAID CHLD J/JD_22.0",1]
[null,null,null,"TTL CIT WOR CHLD J/JD (EXCL. SP)_22.0",1]
[null,null,null,"TTL PL CHLD J/JD (INCL. SP)_22.0",1]
[null,null,null,"TTL PL CHLD J/JD (EXCL. SP)_22.0",1]
[null,null,null,"MAINSTREAM OJ/OJ SPECIALTY BLENDS",1]
[null,null,null,"MAINSTREAM OJ/OJ SB QTG",1]
[null,null,null,"TTL TPP OJ + T50 OJ_22.0",1]
[null,null,null,"TTL TPP OJ + T50 OJ 59-64OZ_22.0",1]
[null,null,null,"TPP, T50 (all) - 59OZ Only_22.0",1]
[null,null,null,"TTL TPP OJ + T50 OJ 12OZ ONLY_22.0",1]
[null,null,null,"OJ/OJ SB DOLE FC_22.0",1]
[null,null,null,"OJ/OJ SB DOLE NFC_22.0",1]
[null,null,null,"TTL TPP OJ_22.0",1]
[null,null,null,"TTL TPP OJ SS_22.0",1]
[null,null,null,"TTL TPP OJ MS 59/64OZ_22.0",1]
[null,null,null,"TTL TPP OJ + T50 OJ 89OZ_22.0",1]
[null,null,null,"TTL TPP OJ + T50 OJ 118/128 OZ_22.0",1]
[null,null,null,"OJ/OJ SB TROP 50 NFC_22.0",1]
[null,null,null,"MAINSTREAM OJ/OJ SB TROP 50 SNGLSRVE 12 OZ 1 CT",1]
[null,null,null,"MAINSTREAM OJ/OJ SB TROP 50 MULTISERVE 59 OZ 1 CT",1]
[null,null,null,"MAINSTREAM OJ/OJ SB TROP 50 MULTISERVE 89 OZ 1 CT",1]
[null,null,null,"MAINSTREAM OJ/OJ SB COCA COLA",1]
[null,null,null,"OJ/OJ SB SIMPLY NFC_22.0",1]
[null,null,null,"OJ/OJ SB SIMPLY NFC SS_22.0",1]
[null,null,null,"OJ/OJ SB MULTISERVE 59 OZ 1 CT PLBTL SIMPLY",1]
[null,null,null,"OJ/OJ SB MULTISERVE 89 OZ 1 CT PLBTL SIMPLY",1]
[null,null,null,"TTL MM OJ (NFC+FC)_22.0",1]
[null,null,null,"OJ/OJ SB MULTISERVE 59 OZ 1 CT PLBTL MINUTE MAID PURE SQUEEZED",1]
[null,null,null,"MAINSTREAM OJ/OJ SB MINUTE MAID",1]
[null,null,null,"TTL MM OJ FC 59/64OZ_22.0",1]
[null,null,null,"OJ/OJ SB MULTISERVE 128 OZ (1G) 1 CT JUG MINUTE MAID",1]
[null,null,null,"MAINSTREAM OJ/OJ SB CITRUS WORLD INC",1]
[null,null,null,"OJ/OJ SB FLORIDAS NATURAL NFC_22.0",1]
[null,null,null,"OJ/OJ SB FN NFC 59/64OZ_22.0",1]
[null,null,null,"OJ/OJ SB FN NFC 89/96OZ_22.0",1]
[null,null,null,"MAINSTREAM OJ/OJ SB PRIVATE LABEL",1]
[null,null,null,"TTL GRAPEFRUIT_22.0",1]
[null,null,null,"QTG AO 100% JC NFC GRFT_22.0",1]
[null,null,null,"SIMPLY AO 100% JC NFC GRFT_22.0",1]
[null,null,null,"FLORIDAS NATURAL AO 100% JC NFC GRFT_22.0",1]
[null,null,null,"MAINSTREAM AO 100% JUICE (EX OJ)",1]
[null,null,null,"Tropicana Prem Drinks -  Lemonades 59OZ_22.0",1]
[null,null,null,"MAINSTREAM AO 100% JC (XOJ) QTG",1]
[null,null,null,"MAINSTREAM AO 100% JC (XOJ) TROPICANA",1]
[null,null,null,"MAINSTREAM AO 100% JC (XOJ) TROPICANA FARMSTAND",1]
[null,null,null,"MAINSTREAM AO 100% JC (XOJ) TROP 50",1]
[null,null,null,"MAINSTREAM AO 100% JC (XOJ) DOLE BLENDS",1]
[null,null,null,"AO 100% JC (XOJ) SNGLSRVE 12 OZ 1 CT PLBTL QTG",1]
[null,null,null,"MAINSTREAM AO 100% JC (XOJ) COCA COLA",1]
[null,null,null,"MAINSTREAM AO 100% JC (XOJ) SIMPLY",1]
[null,null,null,"MAINSTREAM AO 100% JC (XOJ) MINUTE MAID",1]
[null,null,null,"MAINSTREAM CHILLED DRINKS",1]
[null,null,null,"MAINSTREAM CHLDDRNK QTG",1]
[null,null,null,"MAINSTREAM CHLDDRNK TROPICANA",1]
[null,null,null,"MAINSTREAM CHLDDRNK TROP 50",1]
[null,null,null,"MAINSTREAM CHLDDRNK COCA COLA",1]
[null,null,null,"MAINSTREAM CHLDDRNK SIMPLY",1]
[null,null,null,"MAINSTREAM CHLDDRNK SIMPLY LEMONADE",1]
[null,null,null,"MAINSTREAM CHLDDRNK MINUTE MAID",1]
[null,null,null,"MAINSTREAM CHLDDRNK SUNNY DELIGHT CO",1]
[null,null,null,"MAINSTREAM CHILLED TEA",1]
[null,null,null,"MAINSTREAM CHLD TEA LIPTON PURELEAF",1]
[null,null,null,"MAINSTREAM CHLD TEA GOLD PEAK",1]
[null,null,null,"MAINSTREAM CHLD TEA DEAN FOODS",1]
[null,null,null,"MAINSTREAM CHLD TEA TURKEY HILL",1]
[null,null,null,"MAINSTREAM CHLD TEA RED DIAMOND",1]
[null,null,null,"MAINSTREAM CHLD TEA MILOS TEA COMPANY",1]
[null,null,null,"MAINSTREAM CHLD TEA PRIVATE LABEL",1]
[null,null,null,"MAINSTREAM CHILLED COFFEE",1]
[null,null,null,"MAINSTREAM CHLD CFE STARBUCKS",1]
[null,null,null,"MAINSTREAM CHLD CFE STARBUCKS BREWED TO PERSONALIZE MULTISERVE 48 OZ 1 CT PLASTIC BOTTLE",1]
[null,null,null,"MAINSTREAM CHLD CFE STARBUCKS ICED ESPRESSO CLASSICS",1]
[null,null,null,"CA_Starbucks Skinny Latte_22.0",1]
[null,null,null,"MAINSTREAM CHLD CFE INTERNATIONAL DELIGHT",1]
[null,null,null,"MAINSTREAM CHLD CFE ILLY ISSIMO",1]
[null,null,null,"MAINSTREAM CHLD CFE PRIVATE LABEL",1]
[null,null,null,"PCW",1]
[null,null,null,"Total Naked Juice",1]
[null,null,null,"TTL SP NAKED SS_22.0",1]
[null,null,null,"TTL SP NAKED MS_22.0",1]
[null,null,null,"Naked 15.2 oz",1]
[null,null,null,"Naked 32 oz",1]
[null,null,null,"Naked 64 oz",1]
[null,null,null,"Total BHF",1]
[null,null,null,"BHF SPJ MS",1]
[null,null,null,"BHF SPJ SS",1]
[null,null,null,"BHF SPJ 11 oz",1]
[null,null,null,"BHF SPJ 32 oz",1]
[null,null,null,"BHF SPJ 52 oz",1]
[null,null,null,"Total ODW",1]
[null,null,null,"Total ODW MS",1]
[null,null,null,"Total ODW SS",1]
[null,null,null,"ODW 12 / 15 oz",1]
[null,null,null,"ODW 32 oz",1]
[null,null,null,"SUPER PREMIUM JUICE EVOLUTION",1]
[null,null,null,"SUPER PREMIUM JC EVLTN MULTISERVE",1]
[null,null,null,"SUPER PREMIUM JC EVLTN SINGLE SERVE",1]
[null,null,null,"SUPER PREMIUM JUICE EVOLUTION FRESH",1]
[null,null,null,"SUPER PREMIUM JUICE EVOLUTION FRESH SINGLE SERVE",1]
[null,null,null,"Total POW Wonderful",1]
[null,null,null,"SUPER PREMIUM POM WNDRFL SINGLE SERVE",1]
[null,null,null,"SUPER PREMIUM POM WNDRFL MULTISERVE",1]
[null,null,null,"SUPER PREMIUM POM WNDRFL SNGLSRVE 16 OZ",1]
[null,null,null,"SUPER PREMIUM POM WNDRFL SNGLSRVE 24 OZ",1]
[null,null,null,"SUPER PREMIUM POM WNDRFL MULTISERVE 48 OZ",1]
[null,null,null,"SUPER PREMIUM GTS KOMBUCHA SYNERGY",1]
[null,null,null,"SUPER PREMIUM KEVITA INC",1]
[null,null,null,"SUPER PREMIUM SAMBAZON",1]
[null,null,null,"SUPER PREMIUM NOBLE",1]
[null,null,null,"SUPER PREMIUM BLUEPRINT JUICE",1]
[null,null,null,"SUPER PREMIUM SUJA",1]
[null,null,null,null,1]
[null,null,null,null,1]
[null,null,null,null,1]
[null,null,null,null,1]

{"sheet":"Notes","index":6,"n_rows":44,"n_cols":7,"rows_kept":44,"cut":false,"hidden":true,"merged":[]}
["NOTES TAB - FOR INTERNAL IRI USE ONLY - should be removed programmatically by last PPC step."]
["Template Change Log:"]
["Date","Who","Notes"]
["2008-08-12","Lam","Example note - added 2 new products to xyz section."]
["2008-08-12","Lam","Added Notes tab"]
[]
[]
[]
["Developer Notes Log:"]
["Date","Who","Notes"]
["2008-08-12","Lefflbine","Example note - adjusted jobcard to increase processing efficiency."]
[]
[]
[]
[]
["Saved Selections Used:"]
["Rpt#","ID","SS Key","Db","Description","Dimension","Creator"]
["qtg_rpt304","LIBRARY"," XLCACSLIZC7187P89","C7187P8","cpgn_qtg_rpt304_prod_ls","PROD","CSLIZ"]
["qtg_rpt304","LIBRARY"," XLCACSNODC9717P86","C9717P8","cpgn_qtg_rpt304_prod_cjd","PROD","CSNOD"]
["qtg_rpt304","LIBRARY"," XLCACSLIZC7187P810","C7187P8","cpgn_qtg_rpt304_prod_ws","PROD","CSLIZ"]
["qtg_rpt304","LIBRARY"," XLCACSJZCC7963P89","C7963P8","cpgn_qtg_rpt304_prod_sd","PROD","CSJZC"]
["qtg_rpt304","LIBRARY"," XLCACSJZCC7963P810","C7963P8","cpgn_qtg_rpt304_prod_wtr","PROD","CSJZC"]
["qtg_rpt304","LIBRARY"," XLCACSLIZC9716P85","C9716P8","cpgn_qtg_rpt304_prod_ssjd","PROD","CSLIZ"]
["qtg_rpt304","LIBRARY"," XLCARCBMDC7517P88","C7517P8","cpgn_qtg_rpt304_prod_pasta","PROD","RCBMD"]
["qtg_rpt304","LIBRARY"," XLCARCBMDC7517P89","C7517P8","cpgn_qtg_rpt304_prod_rice","PROD","RCBMD"]
["qtg_rpt304","LIBRARY"," XLCARCBMDC7964P88","C7964P8","cpgn_qtg_rpt304_prod_pck","PROD","RCBMD"]
["qtg_rpt304","LIBRARY"," XLCARCBMDC7964P89","C7964P8","cpgn_qtg_rpt304_prod_syrup","PROD","RCBMD"]
["qtg_rpt304","LIBRARY"," XLCACSJZCC7963P887","C7963P8","cpgn_qtg_rpt304_meas_sd","MEAS","CSJZC"]
["qtg_rpt304","LIBRARY"," XLCACSJZCC7187P82","C7187P8","cpgn_qtg_rpt304_meas_sd","MEAS","CSJZC"]
["qtg_rpt304","LIBRARY"," XLCACSJZCC7429P82","C7429P8","cpgn_qtg_rpt304_meas_sd","MEAS","CSJZC"]
["qtg_rpt304","LIBRARY"," XLCACSJZCC7517P82","C7517P8","cpgn_qtg_rpt304_meas_rice","MEAS","CSJZC"]
["qtg_rpt304","LIBRARY"," XLCACSJZCC7964P82","C7964P8","cpgn_qtg_rpt304_meas_pan","MEAS","CSJZC"]
["qtg_rpt304","LIBRARY"," XLCARCBMDC7187P814","C7187P8","cpgn_qtg_rpt304_meas_ws","MEAS","RCBMD"]
["qtg_rpt304","LIBRARY"," XLCACSRFMC7429P812","C7429P8","cpgn_qtg_rpt304_prod_hot","PROD","CSRFM"]
["qtg_rpt304","LIBRARY"," XLCACSRFMC7429P813","C7429P8","cpgn_qtg_rpt304_prod_rte","PROD","CSRFM"]
["qtg_rpt304","LIBRARY"," XLCARCBMDC9717P823","C9717P8","cpgn_qtg_rpt304_meas_cjd","MEAS","RCBMD"]
["qtg_rpt304","LIBRARY"," XLCACSJLNC9945P81","C9945P8","cpgn_qtg_rpt304_meas_csd","MEAS","CSJLN"]
["qtg_rpt304","LIBRARY"," XLCACSRFMC7429P845","C7429P8","cpgn_qtg_rpt304_meas_hot","MEAS","CSRFM"]
["qtg_rpt304","LIBRARY"," XLCACSRFMC7429P846","C7429P8","cpgn_qtg_rpt304_prod_grt","PROD","CSRFM"]
["qtg_rpt304","LIBRARY"," XLCACSJZCC9716P82","C9716P8","cpgn_qtg_rpt304_meas_ssjd","MEAS","CSJZC"]
["qtg_rpt304","LIBRARY"," XLCARCBMDC9669P81","C9669P8","cpgn_qtg_rpt304_prod_ss","PROD","RCBMD"]
["qtg_rpt304","LIBRARY"," XLCACSJZCC9717P82","C9717P8","cpgn_qtg_rpt304_meas_sd","MEAS","CSJZC"]
["qtg_rpt304","LIBRARY"," XLCACSSURC9945P816","C9945P8","cpgn_qtg_rpt304_prod_csd","PROD","CSSUR"]
["qtg_rpt304","LIBRARY"," XLCADSJNWC9669P83","C9669P8","cpgn_qtg_rpt304_meas_ss","MEAS","DSJNW"]

{"sheet":"ILD-Data-1-Ref","index":7,"n_rows":105,"n_cols":26,"rows_kept":105,"cut":false,"hidden":true,"merged":[]}
[{"$f":"Picture!B5","v":0},{"$f":"Picture!C5","v":0},{"$f":"Picture!D5","v":0},{"$f":"Picture!E5","v":0},{"$f":"Picture!F5","v":0},{"$f":"Picture!G5","v":0},{"$f":"Picture!H5","v":0},{"$f":"Picture!I5","v":0},{"$f":"Picture!J5","v":0},{"$f":"Picture!K5","v":0},{"$f":"Picture!L5","v":0},{"$f":"Picture!M5","v":0},{"$f":"Picture!N5","v":0},{"$f":"Picture!O5","v":0},{"$f":"Picture!P5","v":0},{"$f":"Picture!Q5","v":0},{"$f":"Picture!R5","v":0},{"$f":"Picture!S5","v":0},{"$f":"Picture!T5","v":0},{"$f":"Picture!U5","v":0},{"$f":"Picture!V5","v":0},{"$f":"Picture!W5","v":0},{"$f":"Picture!X5","v":0},{"$f":"Picture!Y5","v":0},{"$f":"Picture!Z5","v":0},{"$f":"Picture!AA5","v":0}]
[{"$f":"Picture!B6","v":0},{"$f":"Picture!C6","v":0},{"$f":"Picture!D6","v":0},{"$f":"Picture!E6","v":0},{"$f":"Picture!F6","v":0},{"$f":"Picture!G6","v":0},{"$f":"Picture!H6","v":0},{"$f":"Picture!I6","v":0},{"$f":"Picture!J6","v":0},{"$f":"Picture!K6","v":0},{"$f":"Picture!L6","v":0},{"$f":"Picture!M6","v":0},{"$f":"Picture!N6","v":0},{"$f":"Picture!O6","v":0},{"$f":"Picture!P6","v":0},{"$f":"Picture!Q6","v":0},{"$f":"Picture!R6","v":0},{"$f":"Picture!S6","v":0},{"$f":"Picture!T6","v":0},{"$f":"Picture!U6","v":0},{"$f":"Picture!V6","v":0},{"$f":"Picture!W6","v":0},{"$f":"Picture!X6","v":0},{"$f":"Picture!Y6","v":0},{"$f":"Picture!Z6","v":0},{"$f":"Picture!AA6","v":0}]
[{"$f":"Picture!B7","v":0},{"$f":"Picture!C7","v":0},{"$f":"Picture!D7","v":0},{"$f":"Picture!E7","v":0},{"$f":"Picture!F7","v":0},{"$f":"Picture!G7","v":0},{"$f":"Picture!H7","v":0},{"$f":"Picture!I7","v":0},{"$f":"Picture!J7","v":0},{"$f":"Picture!K7","v":0},{"$f":"Picture!L7","v":0},{"$f":"Picture!M7","v":0},{"$f":"Picture!N7","v":0},{"$f":"Picture!O7","v":0},{"$f":"Picture!P7","v":0},{"$f":"Picture!Q7","v":0},{"$f":"Picture!R7","v":0},{"$f":"Picture!S7","v":0},{"$f":"Picture!T7","v":0},{"$f":"Picture!U7","v":0},{"$f":"Picture!V7","v":0},{"$f":"Picture!W7","v":0},{"$f":"Picture!X7","v":0},{"$f":"Picture!Y7","v":0},{"$f":"Picture!Z7","v":0},{"$f":"Picture!AA7","v":0}]
[{"$f":"Picture!B8","v":0},{"$f":"Picture!C8","v":0},{"$f":"Picture!D8","v":0},{"$f":"Picture!E8","v":0},{"$f":"Picture!F8","v":0},{"$f":"Picture!G8","v":0},{"$f":"Picture!H8","v":0},{"$f":"Picture!I8","v":0},{"$f":"Picture!J8","v":0},{"$f":"Picture!K8","v":0},{"$f":"Picture!L8","v":0},{"$f":"Picture!M8","v":0},{"$f":"Picture!N8","v":0},{"$f":"Picture!O8","v":0},{"$f":"Picture!P8","v":0},{"$f":"Picture!Q8","v":0},{"$f":"Picture!R8","v":0},{"$f":"Picture!S8","v":0},{"$f":"Picture!T8","v":0},{"$f":"Picture!U8","v":0},{"$f":"Picture!V8","v":0},{"$f":"Picture!W8","v":0},{"$f":"Picture!X8","v":0},{"$f":"Picture!Y8","v":0},{"$f":"Picture!Z8","v":0},{"$f":"Picture!AA8","v":0}]
[{"$f":"Picture!B9","v":0},{"$f":"Picture!C9","v":0},{"$f":"Picture!D9","v":0},{"$f":"Picture!E9","v":0},{"$f":"Picture!F9","v":0},{"$f":"Picture!G9","v":0},{"$f":"Picture!H9","v":0},{"$f":"Picture!I9","v":0},{"$f":"Picture!J9","v":0},{"$f":"Picture!K9","v":0},{"$f":"Picture!L9","v":0},{"$f":"Picture!M9","v":0},{"$f":"Picture!N9","v":0},{"$f":"Picture!O9","v":0},{"$f":"Picture!P9","v":0},{"$f":"Picture!Q9","v":0},{"$f":"Picture!R9","v":0},{"$f":"Picture!S9","v":0},{"$f":"Picture!T9","v":0},{"$f":"Picture!U9","v":0},{"$f":"Picture!V9","v":0},{"$f":"Picture!W9","v":0},{"$f":"Picture!X9","v":0},{"$f":"Picture!Y9","v":0},{"$f":"Picture!Z9","v":0},{"$f":"Picture!AA9","v":0}]
[{"$f":"Picture!B10","v":0},{"$f":"Picture!C10","v":0},{"$f":"Picture!D10","v":0},{"$f":"Picture!E10","v":0},{"$f":"Picture!F10","v":0},{"$f":"Picture!G10","v":0},{"$f":"Picture!H10","v":0},{"$f":"Picture!I10","v":0},{"$f":"Picture!J10","v":0},{"$f":"Picture!K10","v":0},{"$f":"Picture!L10","v":0},{"$f":"Picture!M10","v":0},{"$f":"Picture!N10","v":0},{"$f":"Picture!O10","v":0},{"$f":"Picture!P10","v":0},{"$f":"Picture!Q10","v":0},{"$f":"Picture!R10","v":0},{"$f":"Picture!S10","v":0},{"$f":"Picture!T10","v":0},{"$f":"Picture!U10","v":0},{"$f":"Picture!V10","v":0},{"$f":"Picture!W10","v":0},{"$f":"Picture!X10","v":0},{"$f":"Picture!Y10","v":0},{"$f":"Picture!Z10","v":0},{"$f":"Picture!AA10","v":0}]
[{"$f":"Picture!B11","v":0},{"$f":"Picture!C11","v":0},{"$f":"Picture!D11","v":0},{"$f":"Picture!E11","v":0},{"$f":"Picture!F11","v":0},{"$f":"Picture!G11","v":0},{"$f":"Picture!H11","v":0},{"$f":"Picture!I11","v":0},{"$f":"Picture!J11","v":0},{"$f":"Picture!K11","v":0},{"$f":"Picture!L11","v":0},{"$f":"Picture!M11","v":0},{"$f":"Picture!N11","v":0},{"$f":"Picture!O11","v":0},{"$f":"Picture!P11","v":0},{"$f":"Picture!Q11","v":0},{"$f":"Picture!R11","v":0},{"$f":"Picture!S11","v":0},{"$f":"Picture!T11","v":0},{"$f":"Picture!U11","v":0},{"$f":"Picture!V11","v":0},{"$f":"Picture!W11","v":0},{"$f":"Picture!X11","v":0},{"$f":"Picture!Y11","v":0},{"$f":"Picture!Z11","v":0},{"$f":"Picture!AA11","v":0}]
[{"$f":"Picture!B12","v":0},{"$f":"Picture!C12","v":0},{"$f":"Picture!D12","v":0},{"$f":"Picture!E12","v":0},{"$f":"Picture!F12","v":0},{"$f":"Picture!G12","v":0},{"$f":"Picture!H12","v":0},{"$f":"Picture!I12","v":0},{"$f":"Picture!J12","v":0},{"$f":"Picture!K12","v":0},{"$f":"Picture!L12","v":0},{"$f":"Picture!M12","v":0},{"$f":"Picture!N12","v":0},{"$f":"Picture!O12","v":0},{"$f":"Picture!P12","v":0},{"$f":"Picture!Q12","v":0},{"$f":"Picture!R12","v":0},{"$f":"Picture!S12","v":0},{"$f":"Picture!T12","v":0},{"$f":"Picture!U12","v":0},{"$f":"Picture!V12","v":0},{"$f":"Picture!W12","v":0},{"$f":"Picture!X12","v":0},{"$f":"Picture!Y12","v":0},{"$f":"Picture!Z12","v":0},{"$f":"Picture!AA12","v":0}]
[{"$f":"Picture!B13","v":0},{"$f":"Picture!C13","v":0},{"$f":"Picture!D13","v":0},{"$f":"Picture!E13","v":0},{"$f":"Picture!F13","v":0},{"$f":"Picture!G13","v":0},{"$f":"Picture!H13","v":0},{"$f":"Picture!I13","v":0},{"$f":"Picture!J13","v":0},{"$f":"Picture!K13","v":0},{"$f":"Picture!L13","v":0},{"$f":"Picture!M13","v":0},{"$f":"Picture!N13","v":0},{"$f":"Picture!O13","v":0},{"$f":"Picture!P13","v":0},{"$f":"Picture!Q13","v":0},{"$f":"Picture!R13","v":0},{"$f":"Picture!S13","v":0},{"$f":"Picture!T13","v":0},{"$f":"Picture!U13","v":0},{"$f":"Picture!V13","v":0},{"$f":"Picture!W13","v":0},{"$f":"Picture!X13","v":0},{"$f":"Picture!Y13","v":0},{"$f":"Picture!Z13","v":0},{"$f":"Picture!AA13","v":0}]
[{"$f":"Picture!B14","v":0},{"$f":"Picture!C14","v":0},{"$f":"Picture!D14","v":0},{"$f":"Picture!E14","v":0},{"$f":"Picture!F14","v":0},{"$f":"Picture!G14","v":0},{"$f":"Picture!H14","v":0},{"$f":"Picture!I14","v":0},{"$f":"Picture!J14","v":0},{"$f":"Picture!K14","v":0},{"$f":"Picture!L14","v":0},{"$f":"Picture!M14","v":0},{"$f":"Picture!N14","v":0},{"$f":"Picture!O14","v":0},{"$f":"Picture!P14","v":0},{"$f":"Picture!Q14","v":0},{"$f":"Picture!R14","v":0},{"$f":"Picture!S14","v":0},{"$f":"Picture!T14","v":0},{"$f":"Picture!U14","v":0},{"$f":"Picture!V14","v":0},{"$f":"Picture!W14","v":0},{"$f":"Picture!X14","v":0},{"$f":"Picture!Y14","v":0},{"$f":"Picture!Z14","v":0},{"$f":"Picture!AA14","v":0}]
[{"$f":"Picture!B15","v":0},{"$f":"Picture!C15","v":0},{"$f":"Picture!D15","v":0},{"$f":"Picture!E15","v":0},{"$f":"Picture!F15","v":0},{"$f":"Picture!G15","v":0},{"$f":"Picture!H15","v":0},{"$f":"Picture!I15","v":0},{"$f":"Picture!J15","v":0},{"$f":"Picture!K15","v":0},{"$f":"Picture!L15","v":0},{"$f":"Picture!M15","v":0},{"$f":"Picture!N15","v":0},{"$f":"Picture!O15","v":0},{"$f":"Picture!P15","v":0},{"$f":"Picture!Q15","v":0},{"$f":"Picture!R15","v":0},{"$f":"Picture!S15","v":0},{"$f":"Picture!T15","v":0},{"$f":"Picture!U15","v":0},{"$f":"Picture!V15","v":0},{"$f":"Picture!W15","v":0},{"$f":"Picture!X15","v":0},{"$f":"Picture!Y15","v":0},{"$f":"Picture!Z15","v":0},{"$f":"Picture!AA15","v":0}]
[{"$f":"Picture!B16","v":0},{"$f":"Picture!C16","v":0},{"$f":"Picture!D16","v":0},{"$f":"Picture!E16","v":0},{"$f":"Picture!F16","v":0},{"$f":"Picture!G16","v":0},{"$f":"Picture!H16","v":0},{"$f":"Picture!I16","v":0},{"$f":"Picture!J16","v":0},{"$f":"Picture!K16","v":0},{"$f":"Picture!L16","v":0},{"$f":"Picture!M16","v":0},{"$f":"Picture!N16","v":0},{"$f":"Picture!O16","v":0},{"$f":"Picture!P16","v":0},{"$f":"Picture!Q16","v":0},{"$f":"Picture!R16","v":0},{"$f":"Picture!S16","v":0},{"$f":"Picture!T16","v":0},{"$f":"Picture!U16","v":0},{"$f":"Picture!V16","v":0},{"$f":"Picture!W16","v":0},{"$f":"Picture!X16","v":0},{"$f":"Picture!Y16","v":0},{"$f":"Picture!Z16","v":0},{"$f":"Picture!AA16","v":0}]
[{"$f":"Picture!B17","v":0},{"$f":"Picture!C17","v":0},{"$f":"Picture!D17","v":0},{"$f":"Picture!E17","v":0},{"$f":"Picture!F17","v":0},{"$f":"Picture!G17","v":0},{"$f":"Picture!H17","v":0},{"$f":"Picture!I17","v":0},{"$f":"Picture!J17","v":0},{"$f":"Picture!K17","v":0},{"$f":"Picture!L17","v":0},{"$f":"Picture!M17","v":0},{"$f":"Picture!N17","v":0},{"$f":"Picture!O17","v":0},{"$f":"Picture!P17","v":0},{"$f":"Picture!Q17","v":0},{"$f":"Picture!R17","v":0},{"$f":"Picture!S17","v":0},{"$f":"Picture!T17","v":0},{"$f":"Picture!U17","v":0},{"$f":"Picture!V17","v":0},{"$f":"Picture!W17","v":0},{"$f":"Picture!X17","v":0},{"$f":"Picture!Y17","v":0},{"$f":"Picture!Z17","v":0},{"$f":"Picture!AA17","v":0}]
[{"$f":"Picture!B18","v":0},{"$f":"Picture!C18","v":0},{"$f":"Picture!D18","v":0},{"$f":"Picture!E18","v":0},{"$f":"Picture!F18","v":0},{"$f":"Picture!G18","v":0},{"$f":"Picture!H18","v":0},{"$f":"Picture!I18","v":0},{"$f":"Picture!J18","v":0},{"$f":"Picture!K18","v":0},{"$f":"Picture!L18","v":0},{"$f":"Picture!M18","v":0},{"$f":"Picture!N18","v":0},{"$f":"Picture!O18","v":0},{"$f":"Picture!P18","v":0},{"$f":"Picture!Q18","v":0},{"$f":"Picture!R18","v":0},{"$f":"Picture!S18","v":0},{"$f":"Picture!T18","v":0},{"$f":"Picture!U18","v":0},{"$f":"Picture!V18","v":0},{"$f":"Picture!W18","v":0},{"$f":"Picture!X18","v":0},{"$f":"Picture!Y18","v":0},{"$f":"Picture!Z18","v":0},{"$f":"Picture!AA18","v":0}]
[{"$f":"Picture!B19","v":0},{"$f":"Picture!C19","v":0},{"$f":"Picture!D19","v":0},{"$f":"Picture!E19","v":0},{"$f":"Picture!F19","v":0},{"$f":"Picture!G19","v":0},{"$f":"Picture!H19","v":0},{"$f":"Picture!I19","v":0},{"$f":"Picture!J19","v":0},{"$f":"Picture!K19","v":0},{"$f":"Picture!L19","v":0},{"$f":"Picture!M19","v":0},{"$f":"Picture!N19","v":0},{"$f":"Picture!O19","v":0},{"$f":"Picture!P19","v":0},{"$f":"Picture!Q19","v":0},{"$f":"Picture!R19","v":0},{"$f":"Picture!S19","v":0},{"$f":"Picture!T19","v":0},{"$f":"Picture!U19","v":0},{"$f":"Picture!V19","v":0},{"$f":"Picture!W19","v":0},{"$f":"Picture!X19","v":0},{"$f":"Picture!Y19","v":0},{"$f":"Picture!Z19","v":0},{"$f":"Picture!AA19","v":0}]
[{"$f":"Picture!B20","v":0},{"$f":"Picture!C20","v":0},{"$f":"Picture!D20","v":0},{"$f":"Picture!E20","v":0},{"$f":"Picture!F20","v":0},{"$f":"Picture!G20","v":0},{"$f":"Picture!H20","v":0},{"$f":"Picture!I20","v":0},{"$f":"Picture!J20","v":0},{"$f":"Picture!K20","v":0},{"$f":"Picture!L20","v":0},{"$f":"Picture!M20","v":0},{"$f":"Picture!N20","v":0},{"$f":"Picture!O20","v":0},{"$f":"Picture!P20","v":0},{"$f":"Picture!Q20","v":0},{"$f":"Picture!R20","v":0},{"$f":"Picture!S20","v":0},{"$f":"Picture!T20","v":0},{"$f":"Picture!U20","v":0},{"$f":"Picture!V20","v":0},{"$f":"Picture!W20","v":0},{"$f":"Picture!X20","v":0},{"$f":"Picture!Y20","v":0},{"$f":"Picture!Z20","v":0},{"$f":"Picture!AA20","v":0}]
[{"$f":"Picture!B21","v":0},{"$f":"Picture!C21","v":0},{"$f":"Picture!D21","v":0},{"$f":"Picture!E21","v":0},{"$f":"Picture!F21","v":0},{"$f":"Picture!G21","v":0},{"$f":"Picture!H21","v":0},{"$f":"Picture!I21","v":0},{"$f":"Picture!J21","v":0},{"$f":"Picture!K21","v":0},{"$f":"Picture!L21","v":0},{"$f":"Picture!M21","v":0},{"$f":"Picture!N21","v":0},{"$f":"Picture!O21","v":0},{"$f":"Picture!P21","v":0},{"$f":"Picture!Q21","v":0},{"$f":"Picture!R21","v":0},{"$f":"Picture!S21","v":0},{"$f":"Picture!T21","v":0},{"$f":"Picture!U21","v":0},{"$f":"Picture!V21","v":0},{"$f":"Picture!W21","v":0},{"$f":"Picture!X21","v":0},{"$f":"Picture!Y21","v":0},{"$f":"Picture!Z21","v":0},{"$f":"Picture!AA21","v":0}]
[{"$f":"Picture!B22","v":0},{"$f":"Picture!C22","v":0},{"$f":"Picture!D22","v":0},{"$f":"Picture!E22","v":0},{"$f":"Picture!F22","v":0},{"$f":"Picture!G22","v":0},{"$f":"Picture!H22","v":0},{"$f":"Picture!I22","v":0},{"$f":"Picture!J22","v":0},{"$f":"Picture!K22","v":0},{"$f":"Picture!L22","v":0},{"$f":"Picture!M22","v":0},{"$f":"Picture!N22","v":0},{"$f":"Picture!O22","v":0},{"$f":"Picture!P22","v":0},{"$f":"Picture!Q22","v":0},{"$f":"Picture!R22","v":0},{"$f":"Picture!S22","v":0},{"$f":"Picture!T22","v":0},{"$f":"Picture!U22","v":0},{"$f":"Picture!V22","v":0},{"$f":"Picture!W22","v":0},{"$f":"Picture!X22","v":0},{"$f":"Picture!Y22","v":0},{"$f":"Picture!Z22","v":0},{"$f":"Picture!AA22","v":0}]
[{"$f":"Picture!B23","v":0},{"$f":"Picture!C23","v":0},{"$f":"Picture!D23","v":0},{"$f":"Picture!E23","v":0},{"$f":"Picture!F23","v":0},{"$f":"Picture!G23","v":0},{"$f":"Picture!H23","v":0},{"$f":"Picture!I23","v":0},{"$f":"Picture!J23","v":0},{"$f":"Picture!K23","v":0},{"$f":"Picture!L23","v":0},{"$f":"Picture!M23","v":0},{"$f":"Picture!N23","v":0},{"$f":"Picture!O23","v":0},{"$f":"Picture!P23","v":0},{"$f":"Picture!Q23","v":0},{"$f":"Picture!R23","v":0},{"$f":"Picture!S23","v":0},{"$f":"Picture!T23","v":0},{"$f":"Picture!U23","v":0},{"$f":"Picture!V23","v":0},{"$f":"Picture!W23","v":0},{"$f":"Picture!X23","v":0},{"$f":"Picture!Y23","v":0},{"$f":"Picture!Z23","v":0},{"$f":"Picture!AA23","v":0}]
[{"$f":"Picture!B24","v":0},{"$f":"Picture!C24","v":0},{"$f":"Picture!D24","v":0},{"$f":"Picture!E24","v":0},{"$f":"Picture!F24","v":0},{"$f":"Picture!G24","v":0},{"$f":"Picture!H24","v":0},{"$f":"Picture!I24","v":0},{"$f":"Picture!J24","v":0},{"$f":"Picture!K24","v":0},{"$f":"Picture!L24","v":0},{"$f":"Picture!M24","v":0},{"$f":"Picture!N24","v":0},{"$f":"Picture!O24","v":0},{"$f":"Picture!P24","v":0},{"$f":"Picture!Q24","v":0},{"$f":"Picture!R24","v":0},{"$f":"Picture!S24","v":0},{"$f":"Picture!T24","v":0},{"$f":"Picture!U24","v":0},{"$f":"Picture!V24","v":0},{"$f":"Picture!W24","v":0},{"$f":"Picture!X24","v":0},{"$f":"Picture!Y24","v":0},{"$f":"Picture!Z24","v":0},{"$f":"Picture!AA24","v":0}]
[{"$f":"Picture!B25","v":0},{"$f":"Picture!C25","v":0},{"$f":"Picture!D25","v":0},{"$f":"Picture!E25","v":0},{"$f":"Picture!F25","v":0},{"$f":"Picture!G25","v":0},{"$f":"Picture!H25","v":0},{"$f":"Picture!I25","v":0},{"$f":"Picture!J25","v":0},{"$f":"Picture!K25","v":0},{"$f":"Picture!L25","v":0},{"$f":"Picture!M25","v":0},{"$f":"Picture!N25","v":0},{"$f":"Picture!O25","v":0},{"$f":"Picture!P25","v":0},{"$f":"Picture!Q25","v":0},{"$f":"Picture!R25","v":0},{"$f":"Picture!S25","v":0},{"$f":"Picture!T25","v":0},{"$f":"Picture!U25","v":0},{"$f":"Picture!V25","v":0},{"$f":"Picture!W25","v":0},{"$f":"Picture!X25","v":0},{"$f":"Picture!Y25","v":0},{"$f":"Picture!Z25","v":0},{"$f":"Picture!AA25","v":0}]
[{"$f":"Picture!B26","v":0},{"$f":"Picture!C26","v":0},{"$f":"Picture!D26","v":0},{"$f":"Picture!E26","v":0},{"$f":"Picture!F26","v":0},{"$f":"Picture!G26","v":0},{"$f":"Picture!H26","v":0},{"$f":"Picture!I26","v":0},{"$f":"Picture!J26","v":0},{"$f":"Picture!K26","v":0},{"$f":"Picture!L26","v":0},{"$f":"Picture!M26","v":0},{"$f":"Picture!N26","v":0},{"$f":"Picture!O26","v":0},{"$f":"Picture!P26","v":0},{"$f":"Picture!Q26","v":0},{"$f":"Picture!R26","v":0},{"$f":"Picture!S26","v":0},{"$f":"Picture!T26","v":0},{"$f":"Picture!U26","v":0},{"$f":"Picture!V26","v":0},{"$f":"Picture!W26","v":0},{"$f":"Picture!X26","v":0},{"$f":"Picture!Y26","v":0},{"$f":"Picture!Z26","v":0},{"$f":"Picture!AA26","v":0}]
[{"$f":"Picture!B27","v":0},{"$f":"Picture!C27","v":0},{"$f":"Picture!D27","v":0},{"$f":"Picture!E27","v":0},{"$f":"Picture!F27","v":0},{"$f":"Picture!G27","v":0},{"$f":"Picture!H27","v":0},{"$f":"Picture!I27","v":0},{"$f":"Picture!J27","v":0},{"$f":"Picture!K27","v":0},{"$f":"Picture!L27","v":0},{"$f":"Picture!M27","v":0},{"$f":"Picture!N27","v":0},{"$f":"Picture!O27","v":0},{"$f":"Picture!P27","v":0},{"$f":"Picture!Q27","v":0},{"$f":"Picture!R27","v":0},{"$f":"Picture!S27","v":0},{"$f":"Picture!T27","v":0},{"$f":"Picture!U27","v":0},{"$f":"Picture!V27","v":0},{"$f":"Picture!W27","v":0},{"$f":"Picture!X27","v":0},{"$f":"Picture!Y27","v":0},{"$f":"Picture!Z27","v":0},{"$f":"Picture!AA27","v":0}]
[{"$f":"Picture!B28","v":0},{"$f":"Picture!C28","v":0},{"$f":"Picture!D28","v":0},{"$f":"Picture!E28","v":0},{"$f":"Picture!F28","v":0},{"$f":"Picture!G28","v":0},{"$f":"Picture!H28","v":0},{"$f":"Picture!I28","v":0},{"$f":"Picture!J28","v":0},{"$f":"Picture!K28","v":0},{"$f":"Picture!L28","v":0},{"$f":"Picture!M28","v":0},{"$f":"Picture!N28","v":0},{"$f":"Picture!O28","v":0},{"$f":"Picture!P28","v":0},{"$f":"Picture!Q28","v":0},{"$f":"Picture!R28","v":0},{"$f":"Picture!S28","v":0},{"$f":"Picture!T28","v":0},{"$f":"Picture!U28","v":0},{"$f":"Picture!V28","v":0},{"$f":"Picture!W28","v":0},{"$f":"Picture!X28","v":0},{"$f":"Picture!Y28","v":0},{"$f":"Picture!Z28","v":0},{"$f":"Picture!AA28","v":0}]
[{"$f":"Picture!B29","v":0},{"$f":"Picture!C29","v":0},{"$f":"Picture!D29","v":0},{"$f":"Picture!E29","v":0},{"$f":"Picture!F29","v":0},{"$f":"Picture!G29","v":0},{"$f":"Picture!H29","v":0},{"$f":"Picture!I29","v":0},{"$f":"Picture!J29","v":0},{"$f":"Picture!K29","v":0},{"$f":"Picture!L29","v":0},{"$f":"Picture!M29","v":0},{"$f":"Picture!N29","v":0},{"$f":"Picture!O29","v":0},{"$f":"Picture!P29","v":0},{"$f":"Picture!Q29","v":0},{"$f":"Picture!R29","v":0},{"$f":"Picture!S29","v":0},{"$f":"Picture!T29","v":0},{"$f":"Picture!U29","v":0},{"$f":"Picture!V29","v":0},{"$f":"Picture!W29","v":0},{"$f":"Picture!X29","v":0},{"$f":"Picture!Y29","v":0},{"$f":"Picture!Z29","v":0},{"$f":"Picture!AA29","v":0}]
[{"$f":"Picture!B30","v":0},{"$f":"Picture!C30","v":0},{"$f":"Picture!D30","v":0},{"$f":"Picture!E30","v":0},{"$f":"Picture!F30","v":0},{"$f":"Picture!G30","v":0},{"$f":"Picture!H30","v":0},{"$f":"Picture!I30","v":0},{"$f":"Picture!J30","v":0},{"$f":"Picture!K30","v":0},{"$f":"Picture!L30","v":0},{"$f":"Picture!M30","v":0},{"$f":"Picture!N30","v":0},{"$f":"Picture!O30","v":0},{"$f":"Picture!P30","v":0},{"$f":"Picture!Q30","v":0},{"$f":"Picture!R30","v":0},{"$f":"Picture!S30","v":0},{"$f":"Picture!T30","v":0},{"$f":"Picture!U30","v":0},{"$f":"Picture!V30","v":0},{"$f":"Picture!W30","v":0},{"$f":"Picture!X30","v":0},{"$f":"Picture!Y30","v":0},{"$f":"Picture!Z30","v":0},{"$f":"Picture!AA30","v":0}]
[{"$f":"Picture!B31","v":0},{"$f":"Picture!C31","v":0},{"$f":"Picture!D31","v":0},{"$f":"Picture!E31","v":0},{"$f":"Picture!F31","v":0},{"$f":"Picture!G31","v":0},{"$f":"Picture!H31","v":0},{"$f":"Picture!I31","v":0},{"$f":"Picture!J31","v":0},{"$f":"Picture!K31","v":0},{"$f":"Picture!L31","v":0},{"$f":"Picture!M31","v":0},{"$f":"Picture!N31","v":0},{"$f":"Picture!O31","v":0},{"$f":"Picture!P31","v":0},{"$f":"Picture!Q31","v":0},{"$f":"Picture!R31","v":0},{"$f":"Picture!S31","v":0},{"$f":"Picture!T31","v":0},{"$f":"Picture!U31","v":0},{"$f":"Picture!V31","v":0},{"$f":"Picture!W31","v":0},{"$f":"Picture!X31","v":0},{"$f":"Picture!Y31","v":0},{"$f":"Picture!Z31","v":0},{"$f":"Picture!AA31","v":0}]
[{"$f":"Picture!B32","v":0},{"$f":"Picture!C32","v":0},{"$f":"Picture!D32","v":0},{"$f":"Picture!E32","v":0},{"$f":"Picture!F32","v":0},{"$f":"Picture!G32","v":0},{"$f":"Picture!H32","v":0},{"$f":"Picture!I32","v":0},{"$f":"Picture!J32","v":0},{"$f":"Picture!K32","v":0},{"$f":"Picture!L32","v":0},{"$f":"Picture!M32","v":0},{"$f":"Picture!N32","v":0},{"$f":"Picture!O32","v":0},{"$f":"Picture!P32","v":0},{"$f":"Picture!Q32","v":0},{"$f":"Picture!R32","v":0},{"$f":"Picture!S32","v":0},{"$f":"Picture!T32","v":0},{"$f":"Picture!U32","v":0},{"$f":"Picture!V32","v":0},{"$f":"Picture!W32","v":0},{"$f":"Picture!X32","v":0},{"$f":"Picture!Y32","v":0},{"$f":"Picture!Z32","v":0},{"$f":"Picture!AA32","v":0}]
[{"$f":"Picture!B33","v":0},{"$f":"Picture!C33","v":0},{"$f":"Picture!D33","v":0},{"$f":"Picture!E33","v":0},{"$f":"Picture!F33","v":0},{"$f":"Picture!G33","v":0},{"$f":"Picture!H33","v":0},{"$f":"Picture!I33","v":0},{"$f":"Picture!J33","v":0},{"$f":"Picture!K33","v":0},{"$f":"Picture!L33","v":0},{"$f":"Picture!M33","v":0},{"$f":"Picture!N33","v":0},{"$f":"Picture!O33","v":0},{"$f":"Picture!P33","v":0},{"$f":"Picture!Q33","v":0},{"$f":"Picture!R33","v":0},{"$f":"Picture!S33","v":0},{"$f":"Picture!T33","v":0},{"$f":"Picture!U33","v":0},{"$f":"Picture!V33","v":0},{"$f":"Picture!W33","v":0},{"$f":"Picture!X33","v":0},{"$f":"Picture!Y33","v":0},{"$f":"Picture!Z33","v":0},{"$f":"Picture!AA33","v":0}]
[{"$f":"Picture!B34","v":0},{"$f":"Picture!C34","v":0},{"$f":"Picture!D34","v":0},{"$f":"Picture!E34","v":0},{"$f":"Picture!F34","v":0},{"$f":"Picture!G34","v":0},{"$f":"Picture!H34","v":0},{"$f":"Picture!I34","v":0},{"$f":"Picture!J34","v":0},{"$f":"Picture!K34","v":0},{"$f":"Picture!L34","v":0},{"$f":"Picture!M34","v":0},{"$f":"Picture!N34","v":0},{"$f":"Picture!O34","v":0},{"$f":"Picture!P34","v":0},{"$f":"Picture!Q34","v":0},{"$f":"Picture!R34","v":0},{"$f":"Picture!S34","v":0},{"$f":"Picture!T34","v":0},{"$f":"Picture!U34","v":0},{"$f":"Picture!V34","v":0},{"$f":"Picture!W34","v":0},{"$f":"Picture!X34","v":0},{"$f":"Picture!Y34","v":0},{"$f":"Picture!Z34","v":0},{"$f":"Picture!AA34","v":0}]
[{"$f":"Picture!B35","v":0},{"$f":"Picture!C35","v":0},{"$f":"Picture!D35","v":0},{"$f":"Picture!E35","v":0},{"$f":"Picture!F35","v":0},{"$f":"Picture!G35","v":0},{"$f":"Picture!H35","v":0},{"$f":"Picture!I35","v":0},{"$f":"Picture!J35","v":0},{"$f":"Picture!K35","v":0},{"$f":"Picture!L35","v":0},{"$f":"Picture!M35","v":0},{"$f":"Picture!N35","v":0},{"$f":"Picture!O35","v":0},{"$f":"Picture!P35","v":0},{"$f":"Picture!Q35","v":0},{"$f":"Picture!R35","v":0},{"$f":"Picture!S35","v":0},{"$f":"Picture!T35","v":0},{"$f":"Picture!U35","v":0},{"$f":"Picture!V35","v":0},{"$f":"Picture!W35","v":0},{"$f":"Picture!X35","v":0},{"$f":"Picture!Y35","v":0},{"$f":"Picture!Z35","v":0},{"$f":"Picture!AA35","v":0}]
[{"$f":"Picture!B36","v":0},{"$f":"Picture!C36","v":0},{"$f":"Picture!D36","v":0},{"$f":"Picture!E36","v":0},{"$f":"Picture!F36","v":0},{"$f":"Picture!G36","v":0},{"$f":"Picture!H36","v":0},{"$f":"Picture!I36","v":0},{"$f":"Picture!J36","v":0},{"$f":"Picture!K36","v":0},{"$f":"Picture!L36","v":0},{"$f":"Picture!M36","v":0},{"$f":"Picture!N36","v":0},{"$f":"Picture!O36","v":0},{"$f":"Picture!P36","v":0},{"$f":"Picture!Q36","v":0},{"$f":"Picture!R36","v":0},{"$f":"Picture!S36","v":0},{"$f":"Picture!T36","v":0},{"$f":"Picture!U36","v":0},{"$f":"Picture!V36","v":0},{"$f":"Picture!W36","v":0},{"$f":"Picture!X36","v":0},{"$f":"Picture!Y36","v":0},{"$f":"Picture!Z36","v":0},{"$f":"Picture!AA36","v":0}]
[{"$f":"Picture!B37","v":0},{"$f":"Picture!C37","v":0},{"$f":"Picture!D37","v":0},{"$f":"Picture!E37","v":0},{"$f":"Picture!F37","v":0},{"$f":"Picture!G37","v":0},{"$f":"Picture!H37","v":0},{"$f":"Picture!I37","v":0},{"$f":"Picture!J37","v":0},{"$f":"Picture!K37","v":0},{"$f":"Picture!L37","v":0},{"$f":"Picture!M37","v":0},{"$f":"Picture!N37","v":0},{"$f":"Picture!O37","v":0},{"$f":"Picture!P37","v":0},{"$f":"Picture!Q37","v":0},{"$f":"Picture!R37","v":0},{"$f":"Picture!S37","v":0},{"$f":"Picture!T37","v":0},{"$f":"Picture!U37","v":0},{"$f":"Picture!V37","v":0},{"$f":"Picture!W37","v":0},{"$f":"Picture!X37","v":0},{"$f":"Picture!Y37","v":0},{"$f":"Picture!Z37","v":0},{"$f":"Picture!AA37","v":0}]
[{"$f":"Picture!B38","v":0},{"$f":"Picture!C38","v":0},{"$f":"Picture!D38","v":0},{"$f":"Picture!E38","v":0},{"$f":"Picture!F38","v":0},{"$f":"Picture!G38","v":0},{"$f":"Picture!H38","v":0},{"$f":"Picture!I38","v":0},{"$f":"Picture!J38","v":0},{"$f":"Picture!K38","v":0},{"$f":"Picture!L38","v":0},{"$f":"Picture!M38","v":0},{"$f":"Picture!N38","v":0},{"$f":"Picture!O38","v":0},{"$f":"Picture!P38","v":0},{"$f":"Picture!Q38","v":0},{"$f":"Picture!R38","v":0},{"$f":"Picture!S38","v":0},{"$f":"Picture!T38","v":0},{"$f":"Picture!U38","v":0},{"$f":"Picture!V38","v":0},{"$f":"Picture!W38","v":0},{"$f":"Picture!X38","v":0},{"$f":"Picture!Y38","v":0},{"$f":"Picture!Z38","v":0},{"$f":"Picture!AA38","v":0}]
[{"$f":"Picture!B39","v":0},{"$f":"Picture!C39","v":0},{"$f":"Picture!D39","v":0},{"$f":"Picture!E39","v":0},{"$f":"Picture!F39","v":0},{"$f":"Picture!G39","v":0},{"$f":"Picture!H39","v":0},{"$f":"Picture!I39","v":0},{"$f":"Picture!J39","v":0},{"$f":"Picture!K39","v":0},{"$f":"Picture!L39","v":0},{"$f":"Picture!M39","v":0},{"$f":"Picture!N39","v":0},{"$f":"Picture!O39","v":0},{"$f":"Picture!P39","v":0},{"$f":"Picture!Q39","v":0},{"$f":"Picture!R39","v":0},{"$f":"Picture!S39","v":0},{"$f":"Picture!T39","v":0},{"$f":"Picture!U39","v":0},{"$f":"Picture!V39","v":0},{"$f":"Picture!W39","v":0},{"$f":"Picture!X39","v":0},{"$f":"Picture!Y39","v":0},{"$f":"Picture!Z39","v":0},{"$f":"Picture!AA39","v":0}]
[{"$f":"Picture!B40","v":0},{"$f":"Picture!C40","v":0},{"$f":"Picture!D40","v":0},{"$f":"Picture!E40","v":0},{"$f":"Picture!F40","v":0},{"$f":"Picture!G40","v":0},{"$f":"Picture!H40","v":0},{"$f":"Picture!I40","v":0},{"$f":"Picture!J40","v":0},{"$f":"Picture!K40","v":0},{"$f":"Picture!L40","v":0},{"$f":"Picture!M40","v":0},{"$f":"Picture!N40","v":0},{"$f":"Picture!O40","v":0},{"$f":"Picture!P40","v":0},{"$f":"Picture!Q40","v":0},{"$f":"Picture!R40","v":0},{"$f":"Picture!S40","v":0},{"$f":"Picture!T40","v":0},{"$f":"Picture!U40","v":0},{"$f":"Picture!V40","v":0},{"$f":"Picture!W40","v":0},{"$f":"Picture!X40","v":0},{"$f":"Picture!Y40","v":0},{"$f":"Picture!Z40","v":0},{"$f":"Picture!AA40","v":0}]
[{"$f":"Picture!B41","v":0},{"$f":"Picture!C41","v":0},{"$f":"Picture!D41","v":0},{"$f":"Picture!E41","v":0},{"$f":"Picture!F41","v":0},{"$f":"Picture!G41","v":0},{"$f":"Picture!H41","v":0},{"$f":"Picture!I41","v":0},{"$f":"Picture!J41","v":0},{"$f":"Picture!K41","v":0},{"$f":"Picture!L41","v":0},{"$f":"Picture!M41","v":0},{"$f":"Picture!N41","v":0},{"$f":"Picture!O41","v":0},{"$f":"Picture!P41","v":0},{"$f":"Picture!Q41","v":0},{"$f":"Picture!R41","v":0},{"$f":"Picture!S41","v":0},{"$f":"Picture!T41","v":0},{"$f":"Picture!U41","v":0},{"$f":"Picture!V41","v":0},{"$f":"Picture!W41","v":0},{"$f":"Picture!X41","v":0},{"$f":"Picture!Y41","v":0},{"$f":"Picture!Z41","v":0},{"$f":"Picture!AA41","v":0}]
[{"$f":"Picture!B42","v":0},{"$f":"Picture!C42","v":0},{"$f":"Picture!D42","v":0},{"$f":"Picture!E42","v":0},{"$f":"Picture!F42","v":0},{"$f":"Picture!G42","v":0},{"$f":"Picture!H42","v":0},{"$f":"Picture!I42","v":0},{"$f":"Picture!J42","v":0},{"$f":"Picture!K42","v":0},{"$f":"Picture!L42","v":0},{"$f":"Picture!M42","v":0},{"$f":"Picture!N42","v":0},{"$f":"Picture!O42","v":0},{"$f":"Picture!P42","v":0},{"$f":"Picture!Q42","v":0},{"$f":"Picture!R42","v":0},{"$f":"Picture!S42","v":0},{"$f":"Picture!T42","v":0},{"$f":"Picture!U42","v":0},{"$f":"Picture!V42","v":0},{"$f":"Picture!W42","v":0},{"$f":"Picture!X42","v":0},{"$f":"Picture!Y42","v":0},{"$f":"Picture!Z42","v":0},{"$f":"Picture!AA42","v":0}]
[{"$f":"Picture!B43","v":0},{"$f":"Picture!C43","v":0},{"$f":"Picture!D43","v":0},{"$f":"Picture!E43","v":0},{"$f":"Picture!F43","v":0},{"$f":"Picture!G43","v":0},{"$f":"Picture!H43","v":0},{"$f":"Picture!I43","v":0},{"$f":"Picture!J43","v":0},{"$f":"Picture!K43","v":0},{"$f":"Picture!L43","v":0},{"$f":"Picture!M43","v":0},{"$f":"Picture!N43","v":0},{"$f":"Picture!O43","v":0},{"$f":"Picture!P43","v":0},{"$f":"Picture!Q43","v":0},{"$f":"Picture!R43","v":0},{"$f":"Picture!S43","v":0},{"$f":"Picture!T43","v":0},{"$f":"Picture!U43","v":0},{"$f":"Picture!V43","v":0},{"$f":"Picture!W43","v":0},{"$f":"Picture!X43","v":0},{"$f":"Picture!Y43","v":0},{"$f":"Picture!Z43","v":0},{"$f":"Picture!AA43","v":0}]
[{"$f":"Picture!B44","v":0},{"$f":"Picture!C44","v":0},{"$f":"Picture!D44","v":0},{"$f":"Picture!E44","v":0},{"$f":"Picture!F44","v":0},{"$f":"Picture!G44","v":0},{"$f":"Picture!H44","v":0},{"$f":"Picture!I44","v":0},{"$f":"Picture!J44","v":0},{"$f":"Picture!K44","v":0},{"$f":"Picture!L44","v":0},{"$f":"Picture!M44","v":0},{"$f":"Picture!N44","v":0},{"$f":"Picture!O44","v":0},{"$f":"Picture!P44","v":0},{"$f":"Picture!Q44","v":0},{"$f":"Picture!R44","v":0},{"$f":"Picture!S44","v":0},{"$f":"Picture!T44","v":0},{"$f":"Picture!U44","v":0},{"$f":"Picture!V44","v":0},{"$f":"Picture!W44","v":0},{"$f":"Picture!X44","v":0},{"$f":"Picture!Y44","v":0},{"$f":"Picture!Z44","v":0},{"$f":"Picture!AA44","v":0}]
[{"$f":"Picture!B45","v":0},{"$f":"Picture!C45","v":0},{"$f":"Picture!D45","v":0},{"$f":"Picture!E45","v":0},{"$f":"Picture!F45","v":0},{"$f":"Picture!G45","v":0},{"$f":"Picture!H45","v":0},{"$f":"Picture!I45","v":0},{"$f":"Picture!J45","v":0},{"$f":"Picture!K45","v":0},{"$f":"Picture!L45","v":0},{"$f":"Picture!M45","v":0},{"$f":"Picture!N45","v":0},{"$f":"Picture!O45","v":0},{"$f":"Picture!P45","v":0},{"$f":"Picture!Q45","v":0},{"$f":"Picture!R45","v":0},{"$f":"Picture!S45","v":0},{"$f":"Picture!T45","v":0},{"$f":"Picture!U45","v":0},{"$f":"Picture!V45","v":0},{"$f":"Picture!W45","v":0},{"$f":"Picture!X45","v":0},{"$f":"Picture!Y45","v":0},{"$f":"Picture!Z45","v":0},{"$f":"Picture!AA45","v":0}]
[{"$f":"Picture!B46","v":0},{"$f":"Picture!C46","v":0},{"$f":"Picture!D46","v":0},{"$f":"Picture!E46","v":0},{"$f":"Picture!F46","v":0},{"$f":"Picture!G46","v":0},{"$f":"Picture!H46","v":0},{"$f":"Picture!I46","v":0},{"$f":"Picture!J46","v":0},{"$f":"Picture!K46","v":0},{"$f":"Picture!L46","v":0},{"$f":"Picture!M46","v":0},{"$f":"Picture!N46","v":0},{"$f":"Picture!O46","v":0},{"$f":"Picture!P46","v":0},{"$f":"Picture!Q46","v":0},{"$f":"Picture!R46","v":0},{"$f":"Picture!S46","v":0},{"$f":"Picture!T46","v":0},{"$f":"Picture!U46","v":0},{"$f":"Picture!V46","v":0},{"$f":"Picture!W46","v":0},{"$f":"Picture!X46","v":0},{"$f":"Picture!Y46","v":0},{"$f":"Picture!Z46","v":0},{"$f":"Picture!AA46","v":0}]
[{"$f":"Picture!B47","v":0},{"$f":"Picture!C47","v":0},{"$f":"Picture!D47","v":0},{"$f":"Picture!E47","v":0},{"$f":"Picture!F47","v":0},{"$f":"Picture!G47","v":0},{"$f":"Picture!H47","v":0},{"$f":"Picture!I47","v":0},{"$f":"Picture!J47","v":0},{"$f":"Picture!K47","v":0},{"$f":"Picture!L47","v":0},{"$f":"Picture!M47","v":0},{"$f":"Picture!N47","v":0},{"$f":"Picture!O47","v":0},{"$f":"Picture!P47","v":0},{"$f":"Picture!Q47","v":0},{"$f":"Picture!R47","v":0},{"$f":"Picture!S47","v":0},{"$f":"Picture!T47","v":0},{"$f":"Picture!U47","v":0},{"$f":"Picture!V47","v":0},{"$f":"Picture!W47","v":0},{"$f":"Picture!X47","v":0},{"$f":"Picture!Y47","v":0},{"$f":"Picture!Z47","v":0},{"$f":"Picture!AA47","v":0}]
[{"$f":"Picture!B48","v":0},{"$f":"Picture!C48","v":0},{"$f":"Picture!D48","v":0},{"$f":"Picture!E48","v":0},{"$f":"Picture!F48","v":0},{"$f":"Picture!G48","v":0},{"$f":"Picture!H48","v":0},{"$f":"Picture!I48","v":0},{"$f":"Picture!J48","v":0},{"$f":"Picture!K48","v":0},{"$f":"Picture!L48","v":0},{"$f":"Picture!M48","v":0},{"$f":"Picture!N48","v":0},{"$f":"Picture!O48","v":0},{"$f":"Picture!P48","v":0},{"$f":"Picture!Q48","v":0},{"$f":"Picture!R48","v":0},{"$f":"Picture!S48","v":0},{"$f":"Picture!T48","v":0},{"$f":"Picture!U48","v":0},{"$f":"Picture!V48","v":0},{"$f":"Picture!W48","v":0},{"$f":"Picture!X48","v":0},{"$f":"Picture!Y48","v":0},{"$f":"Picture!Z48","v":0},{"$f":"Picture!AA48","v":0}]
[{"$f":"Picture!B49","v":0},{"$f":"Picture!C49","v":0},{"$f":"Picture!D49","v":0},{"$f":"Picture!E49","v":0},{"$f":"Picture!F49","v":0},{"$f":"Picture!G49","v":0},{"$f":"Picture!H49","v":0},{"$f":"Picture!I49","v":0},{"$f":"Picture!J49","v":0},{"$f":"Picture!K49","v":0},{"$f":"Picture!L49","v":0},{"$f":"Picture!M49","v":0},{"$f":"Picture!N49","v":0},{"$f":"Picture!O49","v":0},{"$f":"Picture!P49","v":0},{"$f":"Picture!Q49","v":0},{"$f":"Picture!R49","v":0},{"$f":"Picture!S49","v":0},{"$f":"Picture!T49","v":0},{"$f":"Picture!U49","v":0},{"$f":"Picture!V49","v":0},{"$f":"Picture!W49","v":0},{"$f":"Picture!X49","v":0},{"$f":"Picture!Y49","v":0},{"$f":"Picture!Z49","v":0},{"$f":"Picture!AA49","v":0}]
[{"$f":"Picture!B50","v":0},{"$f":"Picture!C50","v":0},{"$f":"Picture!D50","v":0},{"$f":"Picture!E50","v":0},{"$f":"Picture!F50","v":0},{"$f":"Picture!G50","v":0},{"$f":"Picture!H50","v":0},{"$f":"Picture!I50","v":0},{"$f":"Picture!J50","v":0},{"$f":"Picture!K50","v":0},{"$f":"Picture!L50","v":0},{"$f":"Picture!M50","v":0},{"$f":"Picture!N50","v":0},{"$f":"Picture!O50","v":0},{"$f":"Picture!P50","v":0},{"$f":"Picture!Q50","v":0},{"$f":"Picture!R50","v":0},{"$f":"Picture!S50","v":0},{"$f":"Picture!T50","v":0},{"$f":"Picture!U50","v":0},{"$f":"Picture!V50","v":0},{"$f":"Picture!W50","v":0},{"$f":"Picture!X50","v":0},{"$f":"Picture!Y50","v":0},{"$f":"Picture!Z50","v":0},{"$f":"Picture!AA50","v":0}]
[{"$f":"Picture!B51","v":0},{"$f":"Picture!C51","v":0},{"$f":"Picture!D51","v":0},{"$f":"Picture!E51","v":0},{"$f":"Picture!F51","v":0},{"$f":"Picture!G51","v":0},{"$f":"Picture!H51","v":0},{"$f":"Picture!I51","v":0},{"$f":"Picture!J51","v":0},{"$f":"Picture!K51","v":0},{"$f":"Picture!L51","v":0},{"$f":"Picture!M51","v":0},{"$f":"Picture!N51","v":0},{"$f":"Picture!O51","v":0},{"$f":"Picture!P51","v":0},{"$f":"Picture!Q51","v":0},{"$f":"Picture!R51","v":0},{"$f":"Picture!S51","v":0},{"$f":"Picture!T51","v":0},{"$f":"Picture!U51","v":0},{"$f":"Picture!V51","v":0},{"$f":"Picture!W51","v":0},{"$f":"Picture!X51","v":0},{"$f":"Picture!Y51","v":0},{"$f":"Picture!Z51","v":0},{"$f":"Picture!AA51","v":0}]
[{"$f":"Picture!B52","v":0},{"$f":"Picture!C52","v":0},{"$f":"Picture!D52","v":0},{"$f":"Picture!E52","v":0},{"$f":"Picture!F52","v":0},{"$f":"Picture!G52","v":0},{"$f":"Picture!H52","v":0},{"$f":"Picture!I52","v":0},{"$f":"Picture!J52","v":0},{"$f":"Picture!K52","v":0},{"$f":"Picture!L52","v":0},{"$f":"Picture!M52","v":0},{"$f":"Picture!N52","v":0},{"$f":"Picture!O52","v":0},{"$f":"Picture!P52","v":0},{"$f":"Picture!Q52","v":0},{"$f":"Picture!R52","v":0},{"$f":"Picture!S52","v":0},{"$f":"Picture!T52","v":0},{"$f":"Picture!U52","v":0},{"$f":"Picture!V52","v":0},{"$f":"Picture!W52","v":0},{"$f":"Picture!X52","v":0},{"$f":"Picture!Y52","v":0},{"$f":"Picture!Z52","v":0},{"$f":"Picture!AA52","v":0}]
[{"$f":"Picture!B53","v":0},{"$f":"Picture!C53","v":0},{"$f":"Picture!D53","v":0},{"$f":"Picture!E53","v":0},{"$f":"Picture!F53","v":0},{"$f":"Picture!G53","v":0},{"$f":"Picture!H53","v":0},{"$f":"Picture!I53","v":0},{"$f":"Picture!J53","v":0},{"$f":"Picture!K53","v":0},{"$f":"Picture!L53","v":0},{"$f":"Picture!M53","v":0},{"$f":"Picture!N53","v":0},{"$f":"Picture!O53","v":0},{"$f":"Picture!P53","v":0},{"$f":"Picture!Q53","v":0},{"$f":"Picture!R53","v":0},{"$f":"Picture!S53","v":0},{"$f":"Picture!T53","v":0},{"$f":"Picture!U53","v":0},{"$f":"Picture!V53","v":0},{"$f":"Picture!W53","v":0},{"$f":"Picture!X53","v":0},{"$f":"Picture!Y53","v":0},{"$f":"Picture!Z53","v":0},{"$f":"Picture!AA53","v":0}]
[{"$f":"Picture!B54","v":0},{"$f":"Picture!C54","v":0},{"$f":"Picture!D54","v":0},{"$f":"Picture!E54","v":0},{"$f":"Picture!F54","v":0},{"$f":"Picture!G54","v":0},{"$f":"Picture!H54","v":0},{"$f":"Picture!I54","v":0},{"$f":"Picture!J54","v":0},{"$f":"Picture!K54","v":0},{"$f":"Picture!L54","v":0},{"$f":"Picture!M54","v":0},{"$f":"Picture!N54","v":0},{"$f":"Picture!O54","v":0},{"$f":"Picture!P54","v":0},{"$f":"Picture!Q54","v":0},{"$f":"Picture!R54","v":0},{"$f":"Picture!S54","v":0},{"$f":"Picture!T54","v":0},{"$f":"Picture!U54","v":0},{"$f":"Picture!V54","v":0},{"$f":"Picture!W54","v":0},{"$f":"Picture!X54","v":0},{"$f":"Picture!Y54","v":0},{"$f":"Picture!Z54","v":0},{"$f":"Picture!AA54","v":0}]
[{"$f":"Picture!B55","v":0},{"$f":"Picture!C55","v":0},{"$f":"Picture!D55","v":0},{"$f":"Picture!E55","v":0},{"$f":"Picture!F55","v":0},{"$f":"Picture!G55","v":0},{"$f":"Picture!H55","v":0},{"$f":"Picture!I55","v":0},{"$f":"Picture!J55","v":0},{"$f":"Picture!K55","v":0},{"$f":"Picture!L55","v":0},{"$f":"Picture!M55","v":0},{"$f":"Picture!N55","v":0},{"$f":"Picture!O55","v":0},{"$f":"Picture!P55","v":0},{"$f":"Picture!Q55","v":0},{"$f":"Picture!R55","v":0},{"$f":"Picture!S55","v":0},{"$f":"Picture!T55","v":0},{"$f":"Picture!U55","v":0},{"$f":"Picture!V55","v":0},{"$f":"Picture!W55","v":0},{"$f":"Picture!X55","v":0},{"$f":"Picture!Y55","v":0},{"$f":"Picture!Z55","v":0},{"$f":"Picture!AA55","v":0}]
[{"$f":"Picture!B56","v":0},{"$f":"Picture!C56","v":0},{"$f":"Picture!D56","v":0},{"$f":"Picture!E56","v":0},{"$f":"Picture!F56","v":0},{"$f":"Picture!G56","v":0},{"$f":"Picture!H56","v":0},{"$f":"Picture!I56","v":0},{"$f":"Picture!J56","v":0},{"$f":"Picture!K56","v":0},{"$f":"Picture!L56","v":0},{"$f":"Picture!M56","v":0},{"$f":"Picture!N56","v":0},{"$f":"Picture!O56","v":0},{"$f":"Picture!P56","v":0},{"$f":"Picture!Q56","v":0},{"$f":"Picture!R56","v":0},{"$f":"Picture!S56","v":0},{"$f":"Picture!T56","v":0},{"$f":"Picture!U56","v":0},{"$f":"Picture!V56","v":0},{"$f":"Picture!W56","v":0},{"$f":"Picture!X56","v":0},{"$f":"Picture!Y56","v":0},{"$f":"Picture!Z56","v":0},{"$f":"Picture!AA56","v":0}]
[{"$f":"Picture!B57","v":0},{"$f":"Picture!C57","v":0},{"$f":"Picture!D57","v":0},{"$f":"Picture!E57","v":0},{"$f":"Picture!F57","v":0},{"$f":"Picture!G57","v":0},{"$f":"Picture!H57","v":0},{"$f":"Picture!I57","v":0},{"$f":"Picture!J57","v":0},{"$f":"Picture!K57","v":0},{"$f":"Picture!L57","v":0},{"$f":"Picture!M57","v":0},{"$f":"Picture!N57","v":0},{"$f":"Picture!O57","v":0},{"$f":"Picture!P57","v":0},{"$f":"Picture!Q57","v":0},{"$f":"Picture!R57","v":0},{"$f":"Picture!S57","v":0},{"$f":"Picture!T57","v":0},{"$f":"Picture!U57","v":0},{"$f":"Picture!V57","v":0},{"$f":"Picture!W57","v":0},{"$f":"Picture!X57","v":0},{"$f":"Picture!Y57","v":0},{"$f":"Picture!Z57","v":0},{"$f":"Picture!AA57","v":0}]
[{"$f":"Picture!B58","v":0},{"$f":"Picture!C58","v":0},{"$f":"Picture!D58","v":0},{"$f":"Picture!E58","v":0},{"$f":"Picture!F58","v":0},{"$f":"Picture!G58","v":0},{"$f":"Picture!H58","v":0},{"$f":"Picture!I58","v":0},{"$f":"Picture!J58","v":0},{"$f":"Picture!K58","v":0},{"$f":"Picture!L58","v":0},{"$f":"Picture!M58","v":0},{"$f":"Picture!N58","v":0},{"$f":"Picture!O58","v":0},{"$f":"Picture!P58","v":0},{"$f":"Picture!Q58","v":0},{"$f":"Picture!R58","v":0},{"$f":"Picture!S58","v":0},{"$f":"Picture!T58","v":0},{"$f":"Picture!U58","v":0},{"$f":"Picture!V58","v":0},{"$f":"Picture!W58","v":0},{"$f":"Picture!X58","v":0},{"$f":"Picture!Y58","v":0},{"$f":"Picture!Z58","v":0},{"$f":"Picture!AA58","v":0}]
[{"$f":"Picture!B59","v":0},{"$f":"Picture!C59","v":0},{"$f":"Picture!D59","v":0},{"$f":"Picture!E59","v":0},{"$f":"Picture!F59","v":0},{"$f":"Picture!G59","v":0},{"$f":"Picture!H59","v":0},{"$f":"Picture!I59","v":0},{"$f":"Picture!J59","v":0},{"$f":"Picture!K59","v":0},{"$f":"Picture!L59","v":0},{"$f":"Picture!M59","v":0},{"$f":"Picture!N59","v":0},{"$f":"Picture!O59","v":0},{"$f":"Picture!P59","v":0},{"$f":"Picture!Q59","v":0},{"$f":"Picture!R59","v":0},{"$f":"Picture!S59","v":0},{"$f":"Picture!T59","v":0},{"$f":"Picture!U59","v":0},{"$f":"Picture!V59","v":0},{"$f":"Picture!W59","v":0},{"$f":"Picture!X59","v":0},{"$f":"Picture!Y59","v":0},{"$f":"Picture!Z59","v":0},{"$f":"Picture!AA59","v":0}]
[{"$f":"Picture!B60","v":0},{"$f":"Picture!C60","v":0},{"$f":"Picture!D60","v":0},{"$f":"Picture!E60","v":0},{"$f":"Picture!F60","v":0},{"$f":"Picture!G60","v":0},{"$f":"Picture!H60","v":0},{"$f":"Picture!I60","v":0},{"$f":"Picture!J60","v":0},{"$f":"Picture!K60","v":0},{"$f":"Picture!L60","v":0},{"$f":"Picture!M60","v":0},{"$f":"Picture!N60","v":0},{"$f":"Picture!O60","v":0},{"$f":"Picture!P60","v":0},{"$f":"Picture!Q60","v":0},{"$f":"Picture!R60","v":0},{"$f":"Picture!S60","v":0},{"$f":"Picture!T60","v":0},{"$f":"Picture!U60","v":0},{"$f":"Picture!V60","v":0},{"$f":"Picture!W60","v":0},{"$f":"Picture!X60","v":0},{"$f":"Picture!Y60","v":0},{"$f":"Picture!Z60","v":0},{"$f":"Picture!AA60","v":0}]
[{"$f":"Picture!B61","v":0},{"$f":"Picture!C61","v":0},{"$f":"Picture!D61","v":0},{"$f":"Picture!E61","v":0},{"$f":"Picture!F61","v":0},{"$f":"Picture!G61","v":0},{"$f":"Picture!H61","v":0},{"$f":"Picture!I61","v":0},{"$f":"Picture!J61","v":0},{"$f":"Picture!K61","v":0},{"$f":"Picture!L61","v":0},{"$f":"Picture!M61","v":0},{"$f":"Picture!N61","v":0},{"$f":"Picture!O61","v":0},{"$f":"Picture!P61","v":0},{"$f":"Picture!Q61","v":0},{"$f":"Picture!R61","v":0},{"$f":"Picture!S61","v":0},{"$f":"Picture!T61","v":0},{"$f":"Picture!U61","v":0},{"$f":"Picture!V61","v":0},{"$f":"Picture!W61","v":0},{"$f":"Picture!X61","v":0},{"$f":"Picture!Y61","v":0},{"$f":"Picture!Z61","v":0},{"$f":"Picture!AA61","v":0}]
[{"$f":"Picture!B62","v":0},{"$f":"Picture!C62","v":0},{"$f":"Picture!D62","v":0},{"$f":"Picture!E62","v":0},{"$f":"Picture!F62","v":0},{"$f":"Picture!G62","v":0},{"$f":"Picture!H62","v":0},{"$f":"Picture!I62","v":0},{"$f":"Picture!J62","v":0},{"$f":"Picture!K62","v":0},{"$f":"Picture!L62","v":0},{"$f":"Picture!M62","v":0},{"$f":"Picture!N62","v":0},{"$f":"Picture!O62","v":0},{"$f":"Picture!P62","v":0},{"$f":"Picture!Q62","v":0},{"$f":"Picture!R62","v":0},{"$f":"Picture!S62","v":0},{"$f":"Picture!T62","v":0},{"$f":"Picture!U62","v":0},{"$f":"Picture!V62","v":0},{"$f":"Picture!W62","v":0},{"$f":"Picture!X62","v":0},{"$f":"Picture!Y62","v":0},{"$f":"Picture!Z62","v":0},{"$f":"Picture!AA62","v":0}]
[{"$f":"Picture!B63","v":0},{"$f":"Picture!C63","v":0},{"$f":"Picture!D63","v":0},{"$f":"Picture!E63","v":0},{"$f":"Picture!F63","v":0},{"$f":"Picture!G63","v":0},{"$f":"Picture!H63","v":0},{"$f":"Picture!I63","v":0},{"$f":"Picture!J63","v":0},{"$f":"Picture!K63","v":0},{"$f":"Picture!L63","v":0},{"$f":"Picture!M63","v":0},{"$f":"Picture!N63","v":0},{"$f":"Picture!O63","v":0},{"$f":"Picture!P63","v":0},{"$f":"Picture!Q63","v":0},{"$f":"Picture!R63","v":0},{"$f":"Picture!S63","v":0},{"$f":"Picture!T63","v":0},{"$f":"Picture!U63","v":0},{"$f":"Picture!V63","v":0},{"$f":"Picture!W63","v":0},{"$f":"Picture!X63","v":0},{"$f":"Picture!Y63","v":0},{"$f":"Picture!Z63","v":0},{"$f":"Picture!AA63","v":0}]
[{"$f":"Picture!B64","v":0},{"$f":"Picture!C64","v":0},{"$f":"Picture!D64","v":0},{"$f":"Picture!E64","v":0},{"$f":"Picture!F64","v":0},{"$f":"Picture!G64","v":0},{"$f":"Picture!H64","v":0},{"$f":"Picture!I64","v":0},{"$f":"Picture!J64","v":0},{"$f":"Picture!K64","v":0},{"$f":"Picture!L64","v":0},{"$f":"Picture!M64","v":0},{"$f":"Picture!N64","v":0},{"$f":"Picture!O64","v":0},{"$f":"Picture!P64","v":0},{"$f":"Picture!Q64","v":0},{"$f":"Picture!R64","v":0},{"$f":"Picture!S64","v":0},{"$f":"Picture!T64","v":0},{"$f":"Picture!U64","v":0},{"$f":"Picture!V64","v":0},{"$f":"Picture!W64","v":0},{"$f":"Picture!X64","v":0},{"$f":"Picture!Y64","v":0},{"$f":"Picture!Z64","v":0},{"$f":"Picture!AA64","v":0}]
[{"$f":"Picture!B65","v":0},{"$f":"Picture!C65","v":0},{"$f":"Picture!D65","v":0},{"$f":"Picture!E65","v":0},{"$f":"Picture!F65","v":0},{"$f":"Picture!G65","v":0},{"$f":"Picture!H65","v":0},{"$f":"Picture!I65","v":0},{"$f":"Picture!J65","v":0},{"$f":"Picture!K65","v":0},{"$f":"Picture!L65","v":0},{"$f":"Picture!M65","v":0},{"$f":"Picture!N65","v":0},{"$f":"Picture!O65","v":0},{"$f":"Picture!P65","v":0},{"$f":"Picture!Q65","v":0},{"$f":"Picture!R65","v":0},{"$f":"Picture!S65","v":0},{"$f":"Picture!T65","v":0},{"$f":"Picture!U65","v":0},{"$f":"Picture!V65","v":0},{"$f":"Picture!W65","v":0},{"$f":"Picture!X65","v":0},{"$f":"Picture!Y65","v":0},{"$f":"Picture!Z65","v":0},{"$f":"Picture!AA65","v":0}]
[{"$f":"Picture!B66","v":0},{"$f":"Picture!C66","v":0},{"$f":"Picture!D66","v":0},{"$f":"Picture!E66","v":0},{"$f":"Picture!F66","v":0},{"$f":"Picture!G66","v":0},{"$f":"Picture!H66","v":0},{"$f":"Picture!I66","v":0},{"$f":"Picture!J66","v":0},{"$f":"Picture!K66","v":0},{"$f":"Picture!L66","v":0},{"$f":"Picture!M66","v":0},{"$f":"Picture!N66","v":0},{"$f":"Picture!O66","v":0},{"$f":"Picture!P66","v":0},{"$f":"Picture!Q66","v":0},{"$f":"Picture!R66","v":0},{"$f":"Picture!S66","v":0},{"$f":"Picture!T66","v":0},{"$f":"Picture!U66","v":0},{"$f":"Picture!V66","v":0},{"$f":"Picture!W66","v":0},{"$f":"Picture!X66","v":0},{"$f":"Picture!Y66","v":0},{"$f":"Picture!Z66","v":0},{"$f":"Picture!AA66","v":0}]
[{"$f":"Picture!B67","v":0},{"$f":"Picture!C67","v":0},{"$f":"Picture!D67","v":0},{"$f":"Picture!E67","v":0},{"$f":"Picture!F67","v":0},{"$f":"Picture!G67","v":0},{"$f":"Picture!H67","v":0},{"$f":"Picture!I67","v":0},{"$f":"Picture!J67","v":0},{"$f":"Picture!K67","v":0},{"$f":"Picture!L67","v":0},{"$f":"Picture!M67","v":0},{"$f":"Picture!N67","v":0},{"$f":"Picture!O67","v":0},{"$f":"Picture!P67","v":0},{"$f":"Picture!Q67","v":0},{"$f":"Picture!R67","v":0},{"$f":"Picture!S67","v":0},{"$f":"Picture!T67","v":0},{"$f":"Picture!U67","v":0},{"$f":"Picture!V67","v":0},{"$f":"Picture!W67","v":0},{"$f":"Picture!X67","v":0},{"$f":"Picture!Y67","v":0},{"$f":"Picture!Z67","v":0},{"$f":"Picture!AA67","v":0}]
[{"$f":"Picture!B68","v":0},{"$f":"Picture!C68","v":0},{"$f":"Picture!D68","v":0},{"$f":"Picture!E68","v":0},{"$f":"Picture!F68","v":0},{"$f":"Picture!G68","v":0},{"$f":"Picture!H68","v":0},{"$f":"Picture!I68","v":0},{"$f":"Picture!J68","v":0},{"$f":"Picture!K68","v":0},{"$f":"Picture!L68","v":0},{"$f":"Picture!M68","v":0},{"$f":"Picture!N68","v":0},{"$f":"Picture!O68","v":0},{"$f":"Picture!P68","v":0},{"$f":"Picture!Q68","v":0},{"$f":"Picture!R68","v":0},{"$f":"Picture!S68","v":0},{"$f":"Picture!T68","v":0},{"$f":"Picture!U68","v":0},{"$f":"Picture!V68","v":0},{"$f":"Picture!W68","v":0},{"$f":"Picture!X68","v":0},{"$f":"Picture!Y68","v":0},{"$f":"Picture!Z68","v":0},{"$f":"Picture!AA68","v":0}]
[{"$f":"Picture!B69","v":0},{"$f":"Picture!C69","v":0},{"$f":"Picture!D69","v":0},{"$f":"Picture!E69","v":0},{"$f":"Picture!F69","v":0},{"$f":"Picture!G69","v":0},{"$f":"Picture!H69","v":0},{"$f":"Picture!I69","v":0},{"$f":"Picture!J69","v":0},{"$f":"Picture!K69","v":0},{"$f":"Picture!L69","v":0},{"$f":"Picture!M69","v":0},{"$f":"Picture!N69","v":0},{"$f":"Picture!O69","v":0},{"$f":"Picture!P69","v":0},{"$f":"Picture!Q69","v":0},{"$f":"Picture!R69","v":0},{"$f":"Picture!S69","v":0},{"$f":"Picture!T69","v":0},{"$f":"Picture!U69","v":0},{"$f":"Picture!V69","v":0},{"$f":"Picture!W69","v":0},{"$f":"Picture!X69","v":0},{"$f":"Picture!Y69","v":0},{"$f":"Picture!Z69","v":0},{"$f":"Picture!AA69","v":0}]
[{"$f":"Picture!B70","v":0},{"$f":"Picture!C70","v":0},{"$f":"Picture!D70","v":0},{"$f":"Picture!E70","v":0},{"$f":"Picture!F70","v":0},{"$f":"Picture!G70","v":0},{"$f":"Picture!H70","v":0},{"$f":"Picture!I70","v":0},{"$f":"Picture!J70","v":0},{"$f":"Picture!K70","v":0},{"$f":"Picture!L70","v":0},{"$f":"Picture!M70","v":0},{"$f":"Picture!N70","v":0},{"$f":"Picture!O70","v":0},{"$f":"Picture!P70","v":0},{"$f":"Picture!Q70","v":0},{"$f":"Picture!R70","v":0},{"$f":"Picture!S70","v":0},{"$f":"Picture!T70","v":0},{"$f":"Picture!U70","v":0},{"$f":"Picture!V70","v":0},{"$f":"Picture!W70","v":0},{"$f":"Picture!X70","v":0},{"$f":"Picture!Y70","v":0},{"$f":"Picture!Z70","v":0},{"$f":"Picture!AA70","v":0}]
[{"$f":"Picture!B71","v":0},{"$f":"Picture!C71","v":0},{"$f":"Picture!D71","v":0},{"$f":"Picture!E71","v":0},{"$f":"Picture!F71","v":0},{"$f":"Picture!G71","v":0},{"$f":"Picture!H71","v":0},{"$f":"Picture!I71","v":0},{"$f":"Picture!J71","v":0},{"$f":"Picture!K71","v":0},{"$f":"Picture!L71","v":0},{"$f":"Picture!M71","v":0},{"$f":"Picture!N71","v":0},{"$f":"Picture!O71","v":0},{"$f":"Picture!P71","v":0},{"$f":"Picture!Q71","v":0},{"$f":"Picture!R71","v":0},{"$f":"Picture!S71","v":0},{"$f":"Picture!T71","v":0},{"$f":"Picture!U71","v":0},{"$f":"Picture!V71","v":0},{"$f":"Picture!W71","v":0},{"$f":"Picture!X71","v":0},{"$f":"Picture!Y71","v":0},{"$f":"Picture!Z71","v":0},{"$f":"Picture!AA71","v":0}]
[{"$f":"Picture!B72","v":0},{"$f":"Picture!C72","v":0},{"$f":"Picture!D72","v":0},{"$f":"Picture!E72","v":0},{"$f":"Picture!F72","v":0},{"$f":"Picture!G72","v":0},{"$f":"Picture!H72","v":0},{"$f":"Picture!I72","v":0},{"$f":"Picture!J72","v":0},{"$f":"Picture!K72","v":0},{"$f":"Picture!L72","v":0},{"$f":"Picture!M72","v":0},{"$f":"Picture!N72","v":0},{"$f":"Picture!O72","v":0},{"$f":"Picture!P72","v":0},{"$f":"Picture!Q72","v":0},{"$f":"Picture!R72","v":0},{"$f":"Picture!S72","v":0},{"$f":"Picture!T72","v":0},{"$f":"Picture!U72","v":0},{"$f":"Picture!V72","v":0},{"$f":"Picture!W72","v":0},{"$f":"Picture!X72","v":0},{"$f":"Picture!Y72","v":0},{"$f":"Picture!Z72","v":0},{"$f":"Picture!AA72","v":0}]
[{"$f":"Picture!B73","v":0},{"$f":"Picture!C73","v":0},{"$f":"Picture!D73","v":0},{"$f":"Picture!E73","v":0},{"$f":"Picture!F73","v":0},{"$f":"Picture!G73","v":0},{"$f":"Picture!H73","v":0},{"$f":"Picture!I73","v":0},{"$f":"Picture!J73","v":0},{"$f":"Picture!K73","v":0},{"$f":"Picture!L73","v":0},{"$f":"Picture!M73","v":0},{"$f":"Picture!N73","v":0},{"$f":"Picture!O73","v":0},{"$f":"Picture!P73","v":0},{"$f":"Picture!Q73","v":0},{"$f":"Picture!R73","v":0},{"$f":"Picture!S73","v":0},{"$f":"Picture!T73","v":0},{"$f":"Picture!U73","v":0},{"$f":"Picture!V73","v":0},{"$f":"Picture!W73","v":0},{"$f":"Picture!X73","v":0},{"$f":"Picture!Y73","v":0},{"$f":"Picture!Z73","v":0},{"$f":"Picture!AA73","v":0}]
[{"$f":"Picture!B74","v":0},{"$f":"Picture!C74","v":0},{"$f":"Picture!D74","v":0},{"$f":"Picture!E74","v":0},{"$f":"Picture!F74","v":0},{"$f":"Picture!G74","v":0},{"$f":"Picture!H74","v":0},{"$f":"Picture!I74","v":0},{"$f":"Picture!J74","v":0},{"$f":"Picture!K74","v":0},{"$f":"Picture!L74","v":0},{"$f":"Picture!M74","v":0},{"$f":"Picture!N74","v":0},{"$f":"Picture!O74","v":0},{"$f":"Picture!P74","v":0},{"$f":"Picture!Q74","v":0},{"$f":"Picture!R74","v":0},{"$f":"Picture!S74","v":0},{"$f":"Picture!T74","v":0},{"$f":"Picture!U74","v":0},{"$f":"Picture!V74","v":0},{"$f":"Picture!W74","v":0},{"$f":"Picture!X74","v":0},{"$f":"Picture!Y74","v":0},{"$f":"Picture!Z74","v":0},{"$f":"Picture!AA74","v":0}]
[{"$f":"Picture!B75","v":0},{"$f":"Picture!C75","v":0},{"$f":"Picture!D75","v":0},{"$f":"Picture!E75","v":0},{"$f":"Picture!F75","v":0},{"$f":"Picture!G75","v":0},{"$f":"Picture!H75","v":0},{"$f":"Picture!I75","v":0},{"$f":"Picture!J75","v":0},{"$f":"Picture!K75","v":0},{"$f":"Picture!L75","v":0},{"$f":"Picture!M75","v":0},{"$f":"Picture!N75","v":0},{"$f":"Picture!O75","v":0},{"$f":"Picture!P75","v":0},{"$f":"Picture!Q75","v":0},{"$f":"Picture!R75","v":0},{"$f":"Picture!S75","v":0},{"$f":"Picture!T75","v":0},{"$f":"Picture!U75","v":0},{"$f":"Picture!V75","v":0},{"$f":"Picture!W75","v":0},{"$f":"Picture!X75","v":0},{"$f":"Picture!Y75","v":0},{"$f":"Picture!Z75","v":0},{"$f":"Picture!AA75","v":0}]
[{"$f":"Picture!B76","v":0},{"$f":"Picture!C76","v":0},{"$f":"Picture!D76","v":0},{"$f":"Picture!E76","v":0},{"$f":"Picture!F76","v":0},{"$f":"Picture!G76","v":0},{"$f":"Picture!H76","v":0},{"$f":"Picture!I76","v":0},{"$f":"Picture!J76","v":0},{"$f":"Picture!K76","v":0},{"$f":"Picture!L76","v":0},{"$f":"Picture!M76","v":0},{"$f":"Picture!N76","v":0},{"$f":"Picture!O76","v":0},{"$f":"Picture!P76","v":0},{"$f":"Picture!Q76","v":0},{"$f":"Picture!R76","v":0},{"$f":"Picture!S76","v":0},{"$f":"Picture!T76","v":0},{"$f":"Picture!U76","v":0},{"$f":"Picture!V76","v":0},{"$f":"Picture!W76","v":0},{"$f":"Picture!X76","v":0},{"$f":"Picture!Y76","v":0},{"$f":"Picture!Z76","v":0},{"$f":"Picture!AA76","v":0}]
[{"$f":"Picture!B77","v":0},{"$f":"Picture!C77","v":0},{"$f":"Picture!D77","v":0},{"$f":"Picture!E77","v":0},{"$f":"Picture!F77","v":0},{"$f":"Picture!G77","v":0},{"$f":"Picture!H77","v":0},{"$f":"Picture!I77","v":0},{"$f":"Picture!J77","v":0},{"$f":"Picture!K77","v":0},{"$f":"Picture!L77","v":0},{"$f":"Picture!M77","v":0},{"$f":"Picture!N77","v":0},{"$f":"Picture!O77","v":0},{"$f":"Picture!P77","v":0},{"$f":"Picture!Q77","v":0},{"$f":"Picture!R77","v":0},{"$f":"Picture!S77","v":0},{"$f":"Picture!T77","v":0},{"$f":"Picture!U77","v":0},{"$f":"Picture!V77","v":0},{"$f":"Picture!W77","v":0},{"$f":"Picture!X77","v":0},{"$f":"Picture!Y77","v":0},{"$f":"Picture!Z77","v":0},{"$f":"Picture!AA77","v":0}]
[{"$f":"Picture!B78","v":0},{"$f":"Picture!C78","v":0},{"$f":"Picture!D78","v":0},{"$f":"Picture!E78","v":0},{"$f":"Picture!F78","v":0},{"$f":"Picture!G78","v":0},{"$f":"Picture!H78","v":0},{"$f":"Picture!I78","v":0},{"$f":"Picture!J78","v":0},{"$f":"Picture!K78","v":0},{"$f":"Picture!L78","v":0},{"$f":"Picture!M78","v":0},{"$f":"Picture!N78","v":0},{"$f":"Picture!O78","v":0},{"$f":"Picture!P78","v":0},{"$f":"Picture!Q78","v":0},{"$f":"Picture!R78","v":0},{"$f":"Picture!S78","v":0},{"$f":"Picture!T78","v":0},{"$f":"Picture!U78","v":0},{"$f":"Picture!V78","v":0},{"$f":"Picture!W78","v":0},{"$f":"Picture!X78","v":0},{"$f":"Picture!Y78","v":0},{"$f":"Picture!Z78","v":0},{"$f":"Picture!AA78","v":0}]
[{"$f":"Picture!B79","v":0},{"$f":"Picture!C79","v":0},{"$f":"Picture!D79","v":0},{"$f":"Picture!E79","v":0},{"$f":"Picture!F79","v":0},{"$f":"Picture!G79","v":0},{"$f":"Picture!H79","v":0},{"$f":"Picture!I79","v":0},{"$f":"Picture!J79","v":0},{"$f":"Picture!K79","v":0},{"$f":"Picture!L79","v":0},{"$f":"Picture!M79","v":0},{"$f":"Picture!N79","v":0},{"$f":"Picture!O79","v":0},{"$f":"Picture!P79","v":0},{"$f":"Picture!Q79","v":0},{"$f":"Picture!R79","v":0},{"$f":"Picture!S79","v":0},{"$f":"Picture!T79","v":0},{"$f":"Picture!U79","v":0},{"$f":"Picture!V79","v":0},{"$f":"Picture!W79","v":0},{"$f":"Picture!X79","v":0},{"$f":"Picture!Y79","v":0},{"$f":"Picture!Z79","v":0},{"$f":"Picture!AA79","v":0}]
[{"$f":"Picture!B80","v":0},{"$f":"Picture!C80","v":0},{"$f":"Picture!D80","v":0},{"$f":"Picture!E80","v":0},{"$f":"Picture!F80","v":0},{"$f":"Picture!G80","v":0},{"$f":"Picture!H80","v":0},{"$f":"Picture!I80","v":0},{"$f":"Picture!J80","v":0},{"$f":"Picture!K80","v":0},{"$f":"Picture!L80","v":0},{"$f":"Picture!M80","v":0},{"$f":"Picture!N80","v":0},{"$f":"Picture!O80","v":0},{"$f":"Picture!P80","v":0},{"$f":"Picture!Q80","v":0},{"$f":"Picture!R80","v":0},{"$f":"Picture!S80","v":0},{"$f":"Picture!T80","v":0},{"$f":"Picture!U80","v":0},{"$f":"Picture!V80","v":0},{"$f":"Picture!W80","v":0},{"$f":"Picture!X80","v":0},{"$f":"Picture!Y80","v":0},{"$f":"Picture!Z80","v":0},{"$f":"Picture!AA80","v":0}]
[{"$f":"Picture!B81","v":0},{"$f":"Picture!C81","v":0},{"$f":"Picture!D81","v":0},{"$f":"Picture!E81","v":0},{"$f":"Picture!F81","v":0},{"$f":"Picture!G81","v":0},{"$f":"Picture!H81","v":0},{"$f":"Picture!I81","v":0},{"$f":"Picture!J81","v":0},{"$f":"Picture!K81","v":0},{"$f":"Picture!L81","v":0},{"$f":"Picture!M81","v":0},{"$f":"Picture!N81","v":0},{"$f":"Picture!O81","v":0},{"$f":"Picture!P81","v":0},{"$f":"Picture!Q81","v":0},{"$f":"Picture!R81","v":0},{"$f":"Picture!S81","v":0},{"$f":"Picture!T81","v":0},{"$f":"Picture!U81","v":0},{"$f":"Picture!V81","v":0},{"$f":"Picture!W81","v":0},{"$f":"Picture!X81","v":0},{"$f":"Picture!Y81","v":0},{"$f":"Picture!Z81","v":0},{"$f":"Picture!AA81","v":0}]
[{"$f":"Picture!B82","v":0},{"$f":"Picture!C82","v":0},{"$f":"Picture!D82","v":0},{"$f":"Picture!E82","v":0},{"$f":"Picture!F82","v":0},{"$f":"Picture!G82","v":0},{"$f":"Picture!H82","v":0},{"$f":"Picture!I82","v":0},{"$f":"Picture!J82","v":0},{"$f":"Picture!K82","v":0},{"$f":"Picture!L82","v":0},{"$f":"Picture!M82","v":0},{"$f":"Picture!N82","v":0},{"$f":"Picture!O82","v":0},{"$f":"Picture!P82","v":0},{"$f":"Picture!Q82","v":0},{"$f":"Picture!R82","v":0},{"$f":"Picture!S82","v":0},{"$f":"Picture!T82","v":0},{"$f":"Picture!U82","v":0},{"$f":"Picture!V82","v":0},{"$f":"Picture!W82","v":0},{"$f":"Picture!X82","v":0},{"$f":"Picture!Y82","v":0},{"$f":"Picture!Z82","v":0},{"$f":"Picture!AA82","v":0}]
[{"$f":"Picture!B83","v":0},{"$f":"Picture!C83","v":0},{"$f":"Picture!D83","v":0},{"$f":"Picture!E83","v":0},{"$f":"Picture!F83","v":0},{"$f":"Picture!G83","v":0},{"$f":"Picture!H83","v":0},{"$f":"Picture!I83","v":0},{"$f":"Picture!J83","v":0},{"$f":"Picture!K83","v":0},{"$f":"Picture!L83","v":0},{"$f":"Picture!M83","v":0},{"$f":"Picture!N83","v":0},{"$f":"Picture!O83","v":0},{"$f":"Picture!P83","v":0},{"$f":"Picture!Q83","v":0},{"$f":"Picture!R83","v":0},{"$f":"Picture!S83","v":0},{"$f":"Picture!T83","v":0},{"$f":"Picture!U83","v":0},{"$f":"Picture!V83","v":0},{"$f":"Picture!W83","v":0},{"$f":"Picture!X83","v":0},{"$f":"Picture!Y83","v":0},{"$f":"Picture!Z83","v":0},{"$f":"Picture!AA83","v":0}]
[{"$f":"Picture!B84","v":0},{"$f":"Picture!C84","v":0},{"$f":"Picture!D84","v":0},{"$f":"Picture!E84","v":0},{"$f":"Picture!F84","v":0},{"$f":"Picture!G84","v":0},{"$f":"Picture!H84","v":0},{"$f":"Picture!I84","v":0},{"$f":"Picture!J84","v":0},{"$f":"Picture!K84","v":0},{"$f":"Picture!L84","v":0},{"$f":"Picture!M84","v":0},{"$f":"Picture!N84","v":0},{"$f":"Picture!O84","v":0},{"$f":"Picture!P84","v":0},{"$f":"Picture!Q84","v":0},{"$f":"Picture!R84","v":0},{"$f":"Picture!S84","v":0},{"$f":"Picture!T84","v":0},{"$f":"Picture!U84","v":0},{"$f":"Picture!V84","v":0},{"$f":"Picture!W84","v":0},{"$f":"Picture!X84","v":0},{"$f":"Picture!Y84","v":0},{"$f":"Picture!Z84","v":0},{"$f":"Picture!AA84","v":0}]
[{"$f":"Picture!B85","v":0},{"$f":"Picture!C85","v":0},{"$f":"Picture!D85","v":0},{"$f":"Picture!E85","v":0},{"$f":"Picture!F85","v":0},{"$f":"Picture!G85","v":0},{"$f":"Picture!H85","v":0},{"$f":"Picture!I85","v":0},{"$f":"Picture!J85","v":0},{"$f":"Picture!K85","v":0},{"$f":"Picture!L85","v":0},{"$f":"Picture!M85","v":0},{"$f":"Picture!N85","v":0},{"$f":"Picture!O85","v":0},{"$f":"Picture!P85","v":0},{"$f":"Picture!Q85","v":0},{"$f":"Picture!R85","v":0},{"$f":"Picture!S85","v":0},{"$f":"Picture!T85","v":0},{"$f":"Picture!U85","v":0},{"$f":"Picture!V85","v":0},{"$f":"Picture!W85","v":0},{"$f":"Picture!X85","v":0},{"$f":"Picture!Y85","v":0},{"$f":"Picture!Z85","v":0},{"$f":"Picture!AA85","v":0}]
[{"$f":"Picture!B86","v":0},{"$f":"Picture!C86","v":0},{"$f":"Picture!D86","v":0},{"$f":"Picture!E86","v":0},{"$f":"Picture!F86","v":0},{"$f":"Picture!G86","v":0},{"$f":"Picture!H86","v":0},{"$f":"Picture!I86","v":0},{"$f":"Picture!J86","v":0},{"$f":"Picture!K86","v":0},{"$f":"Picture!L86","v":0},{"$f":"Picture!M86","v":0},{"$f":"Picture!N86","v":0},{"$f":"Picture!O86","v":0},{"$f":"Picture!P86","v":0},{"$f":"Picture!Q86","v":0},{"$f":"Picture!R86","v":0},{"$f":"Picture!S86","v":0},{"$f":"Picture!T86","v":0},{"$f":"Picture!U86","v":0},{"$f":"Picture!V86","v":0},{"$f":"Picture!W86","v":0},{"$f":"Picture!X86","v":0},{"$f":"Picture!Y86","v":0},{"$f":"Picture!Z86","v":0},{"$f":"Picture!AA86","v":0}]
[{"$f":"Picture!B87","v":0},{"$f":"Picture!C87","v":0},{"$f":"Picture!D87","v":0},{"$f":"Picture!E87","v":0},{"$f":"Picture!F87","v":0},{"$f":"Picture!G87","v":0},{"$f":"Picture!H87","v":0},{"$f":"Picture!I87","v":0},{"$f":"Picture!J87","v":0},{"$f":"Picture!K87","v":0},{"$f":"Picture!L87","v":0},{"$f":"Picture!M87","v":0},{"$f":"Picture!N87","v":0},{"$f":"Picture!O87","v":0},{"$f":"Picture!P87","v":0},{"$f":"Picture!Q87","v":0},{"$f":"Picture!R87","v":0},{"$f":"Picture!S87","v":0},{"$f":"Picture!T87","v":0},{"$f":"Picture!U87","v":0},{"$f":"Picture!V87","v":0},{"$f":"Picture!W87","v":0},{"$f":"Picture!X87","v":0},{"$f":"Picture!Y87","v":0},{"$f":"Picture!Z87","v":0},{"$f":"Picture!AA87","v":0}]
[{"$f":"Picture!B88","v":0},{"$f":"Picture!C88","v":0},{"$f":"Picture!D88","v":0},{"$f":"Picture!E88","v":0},{"$f":"Picture!F88","v":0},{"$f":"Picture!G88","v":0},{"$f":"Picture!H88","v":0},{"$f":"Picture!I88","v":0},{"$f":"Picture!J88","v":0},{"$f":"Picture!K88","v":0},{"$f":"Picture!L88","v":0},{"$f":"Picture!M88","v":0},{"$f":"Picture!N88","v":0},{"$f":"Picture!O88","v":0},{"$f":"Picture!P88","v":0},{"$f":"Picture!Q88","v":0},{"$f":"Picture!R88","v":0},{"$f":"Picture!S88","v":0},{"$f":"Picture!T88","v":0},{"$f":"Picture!U88","v":0},{"$f":"Picture!V88","v":0},{"$f":"Picture!W88","v":0},{"$f":"Picture!X88","v":0},{"$f":"Picture!Y88","v":0},{"$f":"Picture!Z88","v":0},{"$f":"Picture!AA88","v":0}]
[{"$f":"Picture!B89","v":0},{"$f":"Picture!C89","v":0},{"$f":"Picture!D89","v":0},{"$f":"Picture!E89","v":0},{"$f":"Picture!F89","v":0},{"$f":"Picture!G89","v":0},{"$f":"Picture!H89","v":0},{"$f":"Picture!I89","v":0},{"$f":"Picture!J89","v":0},{"$f":"Picture!K89","v":0},{"$f":"Picture!L89","v":0},{"$f":"Picture!M89","v":0},{"$f":"Picture!N89","v":0},{"$f":"Picture!O89","v":0},{"$f":"Picture!P89","v":0},{"$f":"Picture!Q89","v":0},{"$f":"Picture!R89","v":0},{"$f":"Picture!S89","v":0},{"$f":"Picture!T89","v":0},{"$f":"Picture!U89","v":0},{"$f":"Picture!V89","v":0},{"$f":"Picture!W89","v":0},{"$f":"Picture!X89","v":0},{"$f":"Picture!Y89","v":0},{"$f":"Picture!Z89","v":0},{"$f":"Picture!AA89","v":0}]
[{"$f":"Picture!B90","v":0},{"$f":"Picture!C90","v":0},{"$f":"Picture!D90","v":0},{"$f":"Picture!E90","v":0},{"$f":"Picture!F90","v":0},{"$f":"Picture!G90","v":0},{"$f":"Picture!H90","v":0},{"$f":"Picture!I90","v":0},{"$f":"Picture!J90","v":0},{"$f":"Picture!K90","v":0},{"$f":"Picture!L90","v":0},{"$f":"Picture!M90","v":0},{"$f":"Picture!N90","v":0},{"$f":"Picture!O90","v":0},{"$f":"Picture!P90","v":0},{"$f":"Picture!Q90","v":0},{"$f":"Picture!R90","v":0},{"$f":"Picture!S90","v":0},{"$f":"Picture!T90","v":0},{"$f":"Picture!U90","v":0},{"$f":"Picture!V90","v":0},{"$f":"Picture!W90","v":0},{"$f":"Picture!X90","v":0},{"$f":"Picture!Y90","v":0},{"$f":"Picture!Z90","v":0},{"$f":"Picture!AA90","v":0}]
[{"$f":"Picture!B91","v":0},{"$f":"Picture!C91","v":0},{"$f":"Picture!D91","v":0},{"$f":"Picture!E91","v":0},{"$f":"Picture!F91","v":0},{"$f":"Picture!G91","v":0},{"$f":"Picture!H91","v":0},{"$f":"Picture!I91","v":0},{"$f":"Picture!J91","v":0},{"$f":"Picture!K91","v":0},{"$f":"Picture!L91","v":0},{"$f":"Picture!M91","v":0},{"$f":"Picture!N91","v":0},{"$f":"Picture!O91","v":0},{"$f":"Picture!P91","v":0},{"$f":"Picture!Q91","v":0},{"$f":"Picture!R91","v":0},{"$f":"Picture!S91","v":0},{"$f":"Picture!T91","v":0},{"$f":"Picture!U91","v":0},{"$f":"Picture!V91","v":0},{"$f":"Picture!W91","v":0},{"$f":"Picture!X91","v":0},{"$f":"Picture!Y91","v":0},{"$f":"Picture!Z91","v":0},{"$f":"Picture!AA91","v":0}]
[{"$f":"Picture!B92","v":0},{"$f":"Picture!C92","v":0},{"$f":"Picture!D92","v":0},{"$f":"Picture!E92","v":0},{"$f":"Picture!F92","v":0},{"$f":"Picture!G92","v":0},{"$f":"Picture!H92","v":0},{"$f":"Picture!I92","v":0},{"$f":"Picture!J92","v":0},{"$f":"Picture!K92","v":0},{"$f":"Picture!L92","v":0},{"$f":"Picture!M92","v":0},{"$f":"Picture!N92","v":0},{"$f":"Picture!O92","v":0},{"$f":"Picture!P92","v":0},{"$f":"Picture!Q92","v":0},{"$f":"Picture!R92","v":0},{"$f":"Picture!S92","v":0},{"$f":"Picture!T92","v":0},{"$f":"Picture!U92","v":0},{"$f":"Picture!V92","v":0},{"$f":"Picture!W92","v":0},{"$f":"Picture!X92","v":0},{"$f":"Picture!Y92","v":0},{"$f":"Picture!Z92","v":0},{"$f":"Picture!AA92","v":0}]
[{"$f":"Picture!B93","v":0},{"$f":"Picture!C93","v":0},{"$f":"Picture!D93","v":0},{"$f":"Picture!E93","v":0},{"$f":"Picture!F93","v":0},{"$f":"Picture!G93","v":0},{"$f":"Picture!H93","v":0},{"$f":"Picture!I93","v":0},{"$f":"Picture!J93","v":0},{"$f":"Picture!K93","v":0},{"$f":"Picture!L93","v":0},{"$f":"Picture!M93","v":0},{"$f":"Picture!N93","v":0},{"$f":"Picture!O93","v":0},{"$f":"Picture!P93","v":0},{"$f":"Picture!Q93","v":0},{"$f":"Picture!R93","v":0},{"$f":"Picture!S93","v":0},{"$f":"Picture!T93","v":0},{"$f":"Picture!U93","v":0},{"$f":"Picture!V93","v":0},{"$f":"Picture!W93","v":0},{"$f":"Picture!X93","v":0},{"$f":"Picture!Y93","v":0},{"$f":"Picture!Z93","v":0},{"$f":"Picture!AA93","v":0}]
[{"$f":"Picture!B94","v":0},{"$f":"Picture!C94","v":0},{"$f":"Picture!D94","v":0},{"$f":"Picture!E94","v":0},{"$f":"Picture!F94","v":0},{"$f":"Picture!G94","v":0},{"$f":"Picture!H94","v":0},{"$f":"Picture!I94","v":0},{"$f":"Picture!J94","v":0},{"$f":"Picture!K94","v":0},{"$f":"Picture!L94","v":0},{"$f":"Picture!M94","v":0},{"$f":"Picture!N94","v":0},{"$f":"Picture!O94","v":0},{"$f":"Picture!P94","v":0},{"$f":"Picture!Q94","v":0},{"$f":"Picture!R94","v":0},{"$f":"Picture!S94","v":0},{"$f":"Picture!T94","v":0},{"$f":"Picture!U94","v":0},{"$f":"Picture!V94","v":0},{"$f":"Picture!W94","v":0},{"$f":"Picture!X94","v":0},{"$f":"Picture!Y94","v":0},{"$f":"Picture!Z94","v":0},{"$f":"Picture!AA94","v":0}]
[{"$f":"Picture!B95","v":0},{"$f":"Picture!C95","v":0},{"$f":"Picture!D95","v":0},{"$f":"Picture!E95","v":0},{"$f":"Picture!F95","v":0},{"$f":"Picture!G95","v":0},{"$f":"Picture!H95","v":0},{"$f":"Picture!I95","v":0},{"$f":"Picture!J95","v":0},{"$f":"Picture!K95","v":0},{"$f":"Picture!L95","v":0},{"$f":"Picture!M95","v":0},{"$f":"Picture!N95","v":0},{"$f":"Picture!O95","v":0},{"$f":"Picture!P95","v":0},{"$f":"Picture!Q95","v":0},{"$f":"Picture!R95","v":0},{"$f":"Picture!S95","v":0},{"$f":"Picture!T95","v":0},{"$f":"Picture!U95","v":0},{"$f":"Picture!V95","v":0},{"$f":"Picture!W95","v":0},{"$f":"Picture!X95","v":0},{"$f":"Picture!Y95","v":0},{"$f":"Picture!Z95","v":0},{"$f":"Picture!AA95","v":0}]
[{"$f":"Picture!B96","v":0},{"$f":"Picture!C96","v":0},{"$f":"Picture!D96","v":0},{"$f":"Picture!E96","v":0},{"$f":"Picture!F96","v":0},{"$f":"Picture!G96","v":0},{"$f":"Picture!H96","v":0},{"$f":"Picture!I96","v":0},{"$f":"Picture!J96","v":0},{"$f":"Picture!K96","v":0},{"$f":"Picture!L96","v":0},{"$f":"Picture!M96","v":0},{"$f":"Picture!N96","v":0},{"$f":"Picture!O96","v":0},{"$f":"Picture!P96","v":0},{"$f":"Picture!Q96","v":0},{"$f":"Picture!R96","v":0},{"$f":"Picture!S96","v":0},{"$f":"Picture!T96","v":0},{"$f":"Picture!U96","v":0},{"$f":"Picture!V96","v":0},{"$f":"Picture!W96","v":0},{"$f":"Picture!X96","v":0},{"$f":"Picture!Y96","v":0},{"$f":"Picture!Z96","v":0},{"$f":"Picture!AA96","v":0}]
[{"$f":"Picture!B97","v":0},{"$f":"Picture!C97","v":0},{"$f":"Picture!D97","v":0},{"$f":"Picture!E97","v":0},{"$f":"Picture!F97","v":0},{"$f":"Picture!G97","v":0},{"$f":"Picture!H97","v":0},{"$f":"Picture!I97","v":0},{"$f":"Picture!J97","v":0},{"$f":"Picture!K97","v":0},{"$f":"Picture!L97","v":0},{"$f":"Picture!M97","v":0},{"$f":"Picture!N97","v":0},{"$f":"Picture!O97","v":0},{"$f":"Picture!P97","v":0},{"$f":"Picture!Q97","v":0},{"$f":"Picture!R97","v":0},{"$f":"Picture!S97","v":0},{"$f":"Picture!T97","v":0},{"$f":"Picture!U97","v":0},{"$f":"Picture!V97","v":0},{"$f":"Picture!W97","v":0},{"$f":"Picture!X97","v":0},{"$f":"Picture!Y97","v":0},{"$f":"Picture!Z97","v":0},{"$f":"Picture!AA97","v":0}]
[{"$f":"Picture!B98","v":0},{"$f":"Picture!C98","v":0},{"$f":"Picture!D98","v":0},{"$f":"Picture!E98","v":0},{"$f":"Picture!F98","v":0},{"$f":"Picture!G98","v":0},{"$f":"Picture!H98","v":0},{"$f":"Picture!I98","v":0},{"$f":"Picture!J98","v":0},{"$f":"Picture!K98","v":0},{"$f":"Picture!L98","v":0},{"$f":"Picture!M98","v":0},{"$f":"Picture!N98","v":0},{"$f":"Picture!O98","v":0},{"$f":"Picture!P98","v":0},{"$f":"Picture!Q98","v":0},{"$f":"Picture!R98","v":0},{"$f":"Picture!S98","v":0},{"$f":"Picture!T98","v":0},{"$f":"Picture!U98","v":0},{"$f":"Picture!V98","v":0},{"$f":"Picture!W98","v":0},{"$f":"Picture!X98","v":0},{"$f":"Picture!Y98","v":0},{"$f":"Picture!Z98","v":0},{"$f":"Picture!AA98","v":0}]
[{"$f":"Picture!B99","v":0},{"$f":"Picture!C99","v":0},{"$f":"Picture!D99","v":0},{"$f":"Picture!E99","v":0},{"$f":"Picture!F99","v":0},{"$f":"Picture!G99","v":0},{"$f":"Picture!H99","v":0},{"$f":"Picture!I99","v":0},{"$f":"Picture!J99","v":0},{"$f":"Picture!K99","v":0},{"$f":"Picture!L99","v":0},{"$f":"Picture!M99","v":0},{"$f":"Picture!N99","v":0},{"$f":"Picture!O99","v":0},{"$f":"Picture!P99","v":0},{"$f":"Picture!Q99","v":0},{"$f":"Picture!R99","v":0},{"$f":"Picture!S99","v":0},{"$f":"Picture!T99","v":0},{"$f":"Picture!U99","v":0},{"$f":"Picture!V99","v":0},{"$f":"Picture!W99","v":0},{"$f":"Picture!X99","v":0},{"$f":"Picture!Y99","v":0},{"$f":"Picture!Z99","v":0},{"$f":"Picture!AA99","v":0}]
[{"$f":"Picture!B100","v":0},{"$f":"Picture!C100","v":0},{"$f":"Picture!D100","v":0},{"$f":"Picture!E100","v":0},{"$f":"Picture!F100","v":0},{"$f":"Picture!G100","v":0},{"$f":"Picture!H100","v":0},{"$f":"Picture!I100","v":0},{"$f":"Picture!J100","v":0},{"$f":"Picture!K100","v":0},{"$f":"Picture!L100","v":0},{"$f":"Picture!M100","v":0},{"$f":"Picture!N100","v":0},{"$f":"Picture!O100","v":0},{"$f":"Picture!P100","v":0},{"$f":"Picture!Q100","v":0},{"$f":"Picture!R100","v":0},{"$f":"Picture!S100","v":0},{"$f":"Picture!T100","v":0},{"$f":"Picture!U100","v":0},{"$f":"Picture!V100","v":0},{"$f":"Picture!W100","v":0},{"$f":"Picture!X100","v":0},{"$f":"Picture!Y100","v":0},{"$f":"Picture!Z100","v":0},{"$f":"Picture!AA100","v":0}]
[{"$f":"Picture!B101","v":0},{"$f":"Picture!C101","v":0},{"$f":"Picture!D101","v":0},{"$f":"Picture!E101","v":0},{"$f":"Picture!F101","v":0},{"$f":"Picture!G101","v":0},{"$f":"Picture!H101","v":0},{"$f":"Picture!I101","v":0},{"$f":"Picture!J101","v":0},{"$f":"Picture!K101","v":0},{"$f":"Picture!L101","v":0},{"$f":"Picture!M101","v":0},{"$f":"Picture!N101","v":0},{"$f":"Picture!O101","v":0},{"$f":"Picture!P101","v":0},{"$f":"Picture!Q101","v":0},{"$f":"Picture!R101","v":0},{"$f":"Picture!S101","v":0},{"$f":"Picture!T101","v":0},{"$f":"Picture!U101","v":0},{"$f":"Picture!V101","v":0},{"$f":"Picture!W101","v":0},{"$f":"Picture!X101","v":0},{"$f":"Picture!Y101","v":0},{"$f":"Picture!Z101","v":0},{"$f":"Picture!AA101","v":0}]
[{"$f":"Picture!B102","v":0},{"$f":"Picture!C102","v":0},{"$f":"Picture!D102","v":0},{"$f":"Picture!E102","v":0},{"$f":"Picture!F102","v":0},{"$f":"Picture!G102","v":0},{"$f":"Picture!H102","v":0},{"$f":"Picture!I102","v":0},{"$f":"Picture!J102","v":0},{"$f":"Picture!K102","v":0},{"$f":"Picture!L102","v":0},{"$f":"Picture!M102","v":0},{"$f":"Picture!N102","v":0},{"$f":"Picture!O102","v":0},{"$f":"Picture!P102","v":0},{"$f":"Picture!Q102","v":0},{"$f":"Picture!R102","v":0},{"$f":"Picture!S102","v":0},{"$f":"Picture!T102","v":0},{"$f":"Picture!U102","v":0},{"$f":"Picture!V102","v":0},{"$f":"Picture!W102","v":0},{"$f":"Picture!X102","v":0},{"$f":"Picture!Y102","v":0},{"$f":"Picture!Z102","v":0},{"$f":"Picture!AA102","v":0}]
[{"$f":"Picture!B103","v":0},{"$f":"Picture!C103","v":0},{"$f":"Picture!D103","v":0},{"$f":"Picture!E103","v":0},{"$f":"Picture!F103","v":0},{"$f":"Picture!G103","v":0},{"$f":"Picture!H103","v":0},{"$f":"Picture!I103","v":0},{"$f":"Picture!J103","v":0},{"$f":"Picture!K103","v":0},{"$f":"Picture!L103","v":0},{"$f":"Picture!M103","v":0},{"$f":"Picture!N103","v":0},{"$f":"Picture!O103","v":0},{"$f":"Picture!P103","v":0},{"$f":"Picture!Q103","v":0},{"$f":"Picture!R103","v":0},{"$f":"Picture!S103","v":0},{"$f":"Picture!T103","v":0},{"$f":"Picture!U103","v":0},{"$f":"Picture!V103","v":0},{"$f":"Picture!W103","v":0},{"$f":"Picture!X103","v":0},{"$f":"Picture!Y103","v":0},{"$f":"Picture!Z103","v":0},{"$f":"Picture!AA103","v":0}]
[{"$f":"Picture!B104","v":0},{"$f":"Picture!C104","v":0},{"$f":"Picture!D104","v":0},{"$f":"Picture!E104","v":0},{"$f":"Picture!F104","v":0},{"$f":"Picture!G104","v":0},{"$f":"Picture!H104","v":0},{"$f":"Picture!I104","v":0},{"$f":"Picture!J104","v":0},{"$f":"Picture!K104","v":0},{"$f":"Picture!L104","v":0},{"$f":"Picture!M104","v":0},{"$f":"Picture!N104","v":0},{"$f":"Picture!O104","v":0},{"$f":"Picture!P104","v":0},{"$f":"Picture!Q104","v":0},{"$f":"Picture!R104","v":0},{"$f":"Picture!S104","v":0},{"$f":"Picture!T104","v":0},{"$f":"Picture!U104","v":0},{"$f":"Picture!V104","v":0},{"$f":"Picture!W104","v":0},{"$f":"Picture!X104","v":0},{"$f":"Picture!Y104","v":0},{"$f":"Picture!Z104","v":0},{"$f":"Picture!AA104","v":0}]
[{"$f":"Picture!B105","v":0},{"$f":"Picture!C105","v":0},{"$f":"Picture!D105","v":0},{"$f":"Picture!E105","v":0},{"$f":"Picture!F105","v":0},{"$f":"Picture!G105","v":0},{"$f":"Picture!H105","v":0},{"$f":"Picture!I105","v":0},{"$f":"Picture!J105","v":0},{"$f":"Picture!K105","v":0},{"$f":"Picture!L105","v":0},{"$f":"Picture!M105","v":0},{"$f":"Picture!N105","v":0},{"$f":"Picture!O105","v":0},{"$f":"Picture!P105","v":0},{"$f":"Picture!Q105","v":0},{"$f":"Picture!R105","v":0},{"$f":"Picture!S105","v":0},{"$f":"Picture!T105","v":0},{"$f":"Picture!U105","v":0},{"$f":"Picture!V105","v":0},{"$f":"Picture!W105","v":0},{"$f":"Picture!X105","v":0},{"$f":"Picture!Y105","v":0},{"$f":"Picture!Z105","v":0},{"$f":"Picture!AA105","v":0}]
[{"$f":"Picture!B106","v":0},{"$f":"Picture!C106","v":0},{"$f":"Picture!D106","v":0},{"$f":"Picture!E106","v":0},{"$f":"Picture!F106","v":0},{"$f":"Picture!G106","v":0},{"$f":"Picture!H106","v":0},{"$f":"Picture!I106","v":0},{"$f":"Picture!J106","v":0},{"$f":"Picture!K106","v":0},{"$f":"Picture!L106","v":0},{"$f":"Picture!M106","v":0},{"$f":"Picture!N106","v":0},{"$f":"Picture!O106","v":0},{"$f":"Picture!P106","v":0},{"$f":"Picture!Q106","v":0},{"$f":"Picture!R106","v":0},{"$f":"Picture!S106","v":0},{"$f":"Picture!T106","v":0},{"$f":"Picture!U106","v":0},{"$f":"Picture!V106","v":0},{"$f":"Picture!W106","v":0},{"$f":"Picture!X106","v":0},{"$f":"Picture!Y106","v":0},{"$f":"Picture!Z106","v":0},{"$f":"Picture!AA106","v":0}]
[{"$f":"Picture!B107","v":0},{"$f":"Picture!C107","v":0},{"$f":"Picture!D107","v":0},{"$f":"Picture!E107","v":0},{"$f":"Picture!F107","v":0},{"$f":"Picture!G107","v":0},{"$f":"Picture!H107","v":0},{"$f":"Picture!I107","v":0},{"$f":"Picture!J107","v":0},{"$f":"Picture!K107","v":0},{"$f":"Picture!L107","v":0},{"$f":"Picture!M107","v":0},{"$f":"Picture!N107","v":0},{"$f":"Picture!O107","v":0},{"$f":"Picture!P107","v":0},{"$f":"Picture!Q107","v":0},{"$f":"Picture!R107","v":0},{"$f":"Picture!S107","v":0},{"$f":"Picture!T107","v":0},{"$f":"Picture!U107","v":0},{"$f":"Picture!V107","v":0},{"$f":"Picture!W107","v":0},{"$f":"Picture!X107","v":0},{"$f":"Picture!Y107","v":0},{"$f":"Picture!Z107","v":0},{"$f":"Picture!AA107","v":0}]
[{"$f":"Picture!B108","v":0},{"$f":"Picture!C108","v":0},{"$f":"Picture!D108","v":0},{"$f":"Picture!E108","v":0},{"$f":"Picture!F108","v":0},{"$f":"Picture!G108","v":0},{"$f":"Picture!H108","v":0},{"$f":"Picture!I108","v":0},{"$f":"Picture!J108","v":0},{"$f":"Picture!K108","v":0},{"$f":"Picture!L108","v":0},{"$f":"Picture!M108","v":0},{"$f":"Picture!N108","v":0},{"$f":"Picture!O108","v":0},{"$f":"Picture!P108","v":0},{"$f":"Picture!Q108","v":0},{"$f":"Picture!R108","v":0},{"$f":"Picture!S108","v":0},{"$f":"Picture!T108","v":0},{"$f":"Picture!U108","v":0},{"$f":"Picture!V108","v":0},{"$f":"Picture!W108","v":0},{"$f":"Picture!X108","v":0},{"$f":"Picture!Y108","v":0},{"$f":"Picture!Z108","v":0},{"$f":"Picture!AA108","v":0}]
[{"$f":"Picture!B109","v":0},{"$f":"Picture!C109","v":0},{"$f":"Picture!D109","v":0},{"$f":"Picture!E109","v":0},{"$f":"Picture!F109","v":0},{"$f":"Picture!G109","v":0},{"$f":"Picture!H109","v":0},{"$f":"Picture!I109","v":0},{"$f":"Picture!J109","v":0},{"$f":"Picture!K109","v":0},{"$f":"Picture!L109","v":0},{"$f":"Picture!M109","v":0},{"$f":"Picture!N109","v":0},{"$f":"Picture!O109","v":0},{"$f":"Picture!P109","v":0},{"$f":"Picture!Q109","v":0},{"$f":"Picture!R109","v":0},{"$f":"Picture!S109","v":0},{"$f":"Picture!T109","v":0},{"$f":"Picture!U109","v":0},{"$f":"Picture!V109","v":0},{"$f":"Picture!W109","v":0},{"$f":"Picture!X109","v":0},{"$f":"Picture!Y109","v":0},{"$f":"Picture!Z109","v":0},{"$f":"Picture!AA109","v":0}]

{"sheet":"Picture","index":8,"n_rows":0,"n_cols":0,"rows_kept":0,"cut":false,"hidden":true,"merged":[[0,2,1,2]]}